{"text_format":"1","workbook":"xlsx","n_sheets":2,"sheets":["（0）作業受付票","（8）デジタルカット"],"not_rendered":{"charts":0,"images":2,"macros":1,"external_links":0,"defined_names":0,"comments":0,"pivot_tables":0},"unopened":[],"bounds":{"document_bytes":16777216,"sheet_cells":100000,"rows_first":2000,"rows_last":500,"rows_between":2000,"halvings":0,"cell_chars":16384,"cell_head_chars":4096},"cells_cut":0,"cells_raw":0,"read":"whole","date_system":"1900"}

{"sheet":"（0）作業受付票","index":0,"n_rows":54,"n_cols":96,"rows_kept":54,"cut":false,"hidden":false,"merged":[[14,49,15,58],[10,49,13,58],[43,0,43,8],[43,9,43,15],[38,0,38,4],[38,5,38,9],[38,10,38,15],[34,0,34,4],[34,5,34,9],[34,10,34,15],[42,0,42,4],[12,0,15,11],[30,0,30,4],[30,5,30,9],[30,10,30,15],[17,0,17,13],[17,14,17,41],[40,16,41,29],[42,16,43,29],[38,30,39,40],[38,41,39,48],[40,0,40,4],[40,5,40,9],[40,10,40,15],[40,79,41,89],[38,63,39,64],[34,49,35,62],[36,49,37,62],[36,0,36,4],[36,5,36,9],[36,10,36,15],[33,0,33,8],[33,9,33,15],[35,0,35,8],[35,9,35,15],[37,0,37,8],[37,9,37,15],[32,65,33,78],[32,30,33,40],[32,41,33,48],[32,49,33,62],[32,63,33,64],[34,63,35,64],[36,63,37,64],[40,30,41,40],[22,0,22,97],[38,79,39,89],[34,16,35,29],[36,16,37,29],[36,30,37,40],[36,41,37,48],[36,65,37,78],[36,79,37,89],[31,9,31,15],[31,0,31,8],[30,90,31,97],[32,16,33,29],[34,65,35,78],[34,79,35,89],[32,79,33,89],[32,90,33,97],[36,90,37,97],[34,90,35,97],[30,79,31,89],[30,65,31,78],[30,49,31,62],[30,16,31,29],[30,63,31,64],[30,30,31,40],[0,0,3,7],[32,0,32,4],[32,5,32,9],[32,10,32,15],[0,8,3,40],[8,0,11,11],[8,12,11,48],[14,59,15,64],[12,59,13,64],[10,59,11,64],[8,49,9,58],[8,59,9,64],[26,35,27,40],[26,41,27,46],[26,47,27,52],[26,53,27,58],[26,59,27,97],[1,91,3,92],[4,0,7,11],[4,12,7,48],[4,49,7,58],[4,59,5,64],[6,59,7,64],[6,92,6,97],[7,92,7,97],[18,0,19,13],[20,0,21,13],[46,77,46,97],[48,49,50,70],[42,65,43,78],[42,79,43,89],[47,27,47,36],[44,16,45,29],[18,32,19,41],[14,65,15,97],[12,65,13,97],[10,65,11,94],[10,95,11,97],[40,90,41,97],[40,63,41,64],[42,90,43,97],[29,49,29,51],[29,52,29,64],[30,41,31,48],[48,7,49,16],[48,17,49,26],[34,30,35,40],[46,3,46,15],[1,86,3,90],[1,93,3,97],[0,41,0,48],[1,41,3,48],[0,86,0,97],[0,49,3,54],[0,55,3,85],[42,63,43,64],[38,90,39,97],[40,65,41,78],[8,92,8,97],[9,92,9,97],[4,92,4,97],[5,92,5,97],[4,65,5,91],[8,65,9,88],[6,65,7,91],[8,89,9,91],[42,41,43,48],[42,49,43,62],[34,41,35,48],[17,42,17,55],[17,56,17,69],[17,70,17,83],[53,24,54,26],[52,71,52,88],[52,89,52,97],[51,38,51,40],[51,41,51,58],[51,59,51,67],[52,38,52,40],[51,68,51,70],[51,89,51,97],[51,71,51,88],[52,68,52,70],[52,41,52,58],[52,59,52,67],[53,0,53,23],[52,0,52,15],[51,0,51,2],[51,3,51,15],[53,27,54,97],[50,74,50,94],[50,95,50,97],[48,71,50,73],[44,65,45,78],[44,79,45,89],[44,90,45,97],[44,63,45,64],[48,74,49,76],[48,77,49,97],[47,95,47,97],[47,74,47,94],[47,43,48,48],[47,37,48,42],[47,7,47,16],[50,0,50,6],[47,49,47,52],[46,49,46,51],[46,52,46,73],[46,0,46,2],[46,74,46,76],[51,16,51,18],[52,16,52,18],[52,19,52,26],[52,27,52,37],[51,19,51,26],[51,27,51,37],[47,53,47,73],[49,43,50,48],[49,37,50,42],[50,7,50,16],[50,17,50,26],[50,27,50,36],[48,27,49,36],[47,17,47,26],[28,0,28,97],[29,20,29,48],[45,0,45,8],[45,9,45,15],[47,0,47,6],[48,0,49,6],[38,65,39,78],[42,30,43,40],[44,30,45,40],[38,49,39,62],[40,41,41,48],[40,49,41,62],[38,16,39,29],[42,5,42,9],[42,10,42,15],[44,0,44,4],[44,5,44,9],[44,10,44,15],[39,0,39,8],[39,9,39,15],[41,0,41,8],[41,9,41,15],[46,16,46,19],[46,20,46,48],[29,65,29,68],[29,69,29,97],[44,41,45,48],[44,49,45,62],[16,0,16,97],[18,84,21,97],[17,84,17,97],[12,12,15,48],[23,0,23,97],[24,0,27,12],[29,0,29,2],[29,3,29,15],[29,16,29,19],[18,70,21,83],[18,56,21,69],[18,42,21,55],[18,14,19,22],[18,23,19,31],[20,14,21,22],[20,23,21,41],[24,13,27,25],[24,26,25,34],[26,26,27,34],[24,35,25,97]]}
[0,null,null,null,null,null,null,null,"作業受付票（表紙）",null,null,null,null,null,null,null,null,null,null,null,null,null,null,null,null,null,null,null,null,null,null,null,null,null,null,null,null,null,null,null,null,"受付店",null,null,null,null,null,null,null,"受付日",null,null,null,null,null,"年　　　　　月　　　　　日　　　　　時　　　　　分",null,null,null,null,null,null,null,null,null,null,null,null,null,null,null,null,null,null,null,null,null,null,null,null,null,null,null,null,null,null,"受付枚数"]
[null,null,null,null,null,null,null,null,null,null,null,null,null,null,null,null,null,null,null,null,null,null,null,null,null,null,null,null,null,null,null,null,null,null,null,null,null,null,null,null,null,"　"]
[]
[]
["会社名\n(部署名)",null,null,null,null,null,null,null,null,null,null,null,"",null,null,null,null,null,null,null,null,null,null,null,null,null,null,null,null,null,null,null,null,null,null,null,null,null,null,null,null,null,null,null,null,null,null,null,null,"ご請求先",null,null,null,null,null,null,null,null,null,"会社名",null,null,null,null,null,null,null,null,null,null,null,null,null,null,null,null,null,null,null,null,null,null,null,null,null,null,null,null,null,null,null,null,"決済方法"]
[null,null,null,null,null,null,null,null,null,null,null,null,null,null,null,null,null,null,null,null,null,null,null,null,null,null,null,null,null,null,null,null,null,null,null,null,null,null,null,null,null,null,null,null,null,null,null,null,null,null,null,null,null,null,null,null,null,null,null,null,null,null,null,null,null,null,null,null,null,null,null,null,null,null,null,null,null,null,null,null,null,null,null,null,null,null,null,null,null,null,null,null,"請求以外の場合"]
[null,null,null,null,null,null,null,null,null,null,null,null,null,null,null,null,null,null,null,null,null,null,null,null,null,null,null,null,null,null,null,null,null,null,null,null,null,null,null,null,null,null,null,null,null,null,null,null,null,null,null,null,null,null,null,null,null,null,null,"部署名",null,null,null,null,null,null,null,null,null,null,null,null,null,null,null,null,null,null,null,null,null,null,null,null,null,null,null,null,null,null,null,null,"店頭クレカ"]
[null,null,null,null,null,null,null,null,null,null,null,null,null,null,null,null,null,null,null,null,null,null,null,null,null,null,null,null,null,null,null,null,null,null,null,null,null,null,null,null,null,null,null,null,null,null,null,null,null,null,null,null,null,null,null,null,null,null,null,null,null,null,null,null,null,null,null,null,null,null,null,null,null,null,null,null,null,null,null,null,null,null,null,null,null,null,null,null,null,null,null,null,"WEBクレカ"]
["番組名\n作品名",null,null,null,null,null,null,null,null,null,null,null,"",null,null,null,null,null,null,null,null,null,null,null,null,null,null,null,null,null,null,null,null,null,null,null,null,null,null,null,null,null,null,null,null,null,null,null,null,"ご指定がある場合のみ記入してください",null,null,null,null,null,null,null,null,null,"お名前",null,null,null,null,null,null,null,null,null,null,null,null,null,null,null,null,null,null,null,null,null,null,null,null,null,null,null,null,null,"様",null,null,"コンビニ振込"]
[null,null,null,null,null,null,null,null,null,null,null,null,null,null,null,null,null,null,null,null,null,null,null,null,null,null,null,null,null,null,null,null,null,null,null,null,null,null,null,null,null,null,null,null,null,null,null,null,null,null,null,null,null,null,null,null,null,null,null,null,null,null,null,null,null,null,null,null,null,null,null,null,null,null,null,null,null,null,null,null,null,null,null,null,null,null,null,null,null,null,null,null,"銀行振込"]
[null,null,null,null,null,null,null,null,null,null,null,null,null,null,null,null,null,null,null,null,null,null,null,null,null,null,null,null,null,null,null,null,null,null,null,null,null,null,null,null,null,null,null,null,null,null,null,null,null,"あなたの\nご連絡先",null,null,null,null,null,null,null,null,null,"お名前",null,null,null,null,null,"",null,null,null,null,null,null,null,null,null,null,null,null,null,null,null,null,null,null,null,null,null,null,null,null,null,null,null,null,null,"様"]
[]
["副題名",null,null,null,null,null,null,null,null,null,null,null,"",null,null,null,null,null,null,null,null,null,null,null,null,null,null,null,null,null,null,null,null,null,null,null,null,null,null,null,null,null,null,null,null,null,null,null,null,null,null,null,null,null,null,null,null,null,null,"ＴＥＬ",null,null,null,null,null,""]
[]
[null,null,null,null,null,null,null,null,null,null,null,null,null,null,null,null,null,null,null,null,null,null,null,null,null,null,null,null,null,null,null,null,null,null,null,null,null,null,null,null,null,null,null,null,null,null,null,null,null,"E-mailは連絡を希望される場合のみ記入してください",null,null,null,null,null,null,null,null,null,"E-mail",null,null,null,null,null,""]
[]
[]
["納期",null,null,null,null,null,null,null,null,null,null,null,null,null,"終了連絡",null,null,null,null,null,null,null,null,null,null,null,null,null,null,null,null,null,null,null,null,null,null,null,null,null,null,null,"受付者",null,null,null,null,null,null,null,null,null,null,null,null,null,"集計者",null,null,null,null,null,null,null,null,null,null,null,null,null,"お客様引取サイン",null,null,null,null,null,null,null,null,null,null,null,null,null,"引渡者"]
["/",null,null,null,null,null,null,null,null,null,null,null,null,null,"不要",null,null,null,null,null,null,null,null,"E-mail",null,null,null,null,null,null,null,null,"電話(24h可)"]
[]
[":",null,null,null,null,null,null,null,null,null,null,null,null,null,"電話\n(時間指定)"]
[]
[]
["作業完了後の引取方法"]
["店頭引取",null,null,null,null,null,null,null,null,null,null,null,null,"作業後配送",null,null,null,null,null,null,null,null,null,null,null,null,"配送先"]
[]
[null,null,null,null,null,null,null,null,null,null,null,null,null,null,null,null,null,null,null,null,null,null,null,null,null,null,"配送区分",null,null,null,null,null,null,null,null,"10\n～12",null,null,null,null,null,"12\n～15",null,null,null,null,null,"15\n～17",null,null,null,null,null,"17\n～20",null,null,null,null,null,"配送担当者はお客様引渡後、上部の「引渡者」にサインしてください"]
[]
[]
["□",null,null,"デジタイズ",null,null,null,null,null,null,null,null,null,null,null,null,"受付\n番号",null,null,null,null,null,null,null,null,null,null,null,null,null,null,null,null,null,null,null,null,null,null,null,null,null,null,null,null,null,null,null,null,"□",null,null,"ワーク・アーカイブ",null,null,null,null,null,null,null,null,null,null,null,null,"受付\n番号"]
{"$rows_left_out":25}
{"sheet":"（8）デジタルカット","index":1,"n_rows":60,"n_cols":97,"rows_kept":60,"cut":false,"hidden":false,"merged":[[59,0,59,23],[59,24,60,32],[59,33,60,97],[41,0,41,97],[23,0,23,97],[21,96,22,97],[21,74,22,85],[21,86,22,95],[9,2,10,13],[11,2,12,13],[11,14,12,73],[17,2,22,13],[17,14,22,73],[9,14,10,49],[9,58,9,60],[9,61,9,73],[10,58,10,60],[10,61,10,73],[13,2,16,13],[13,14,16,73],[15,74,16,85],[9,94,9,97],[6,0,22,1],[24,0,40,1],[5,0,5,97],[0,0,3,7],[0,86,0,97],[4,0,4,7],[4,8,4,32],[4,33,4,40],[4,41,4,65],[4,66,4,73],[4,74,4,97],[0,8,3,40],[0,41,0,48],[0,49,1,54],[0,55,1,85],[1,41,3,48],[1,86,3,90],[1,91,3,92],[1,93,3,97],[2,49,3,54],[2,55,3,85],[6,2,8,13],[6,50,8,57],[6,14,8,49],[6,58,8,73],[9,50,10,57],[11,96,12,97],[15,86,16,95],[17,74,18,85],[17,86,18,95],[11,86,12,95],[15,96,16,97],[8,74,8,83],[9,74,10,83],[8,94,8,97],[10,94,10,97],[7,74,7,83],[7,84,7,93],[8,84,8,93],[9,84,10,93],[11,74,12,85],[7,94,7,97],[6,74,6,97],[13,74,14,85],[13,86,14,95],[27,2,28,13],[27,14,28,49],[27,50,28,57],[29,2,30,13],[29,14,30,73],[35,2,40,13],[35,14,40,73],[27,58,27,60],[27,61,27,73],[31,2,34,13],[31,14,34,73],[28,58,28,60],[28,61,28,73],[13,96,14,97],[17,96,18,97],[19,96,20,97],[19,74,20,85],[19,86,20,95],[24,2,26,13],[24,14,26,49],[24,50,26,57],[24,58,26,73],[27,74,28,83],[27,84,28,93],[27,94,27,97],[28,94,28,97],[24,74,24,97],[25,74,25,83],[25,84,25,93],[25,94,25,97],[26,74,26,83],[26,84,26,93],[26,94,26,97],[35,74,36,85],[35,86,36,95],[35,96,36,97],[37,74,38,85],[37,86,38,95],[37,96,38,97],[29,74,30,85],[29,86,30,95],[29,96,30,97],[31,74,32,85],[31,86,32,95],[31,96,32,97],[33,74,34,85],[33,86,34,95],[33,96,34,97],[39,74,40,85],[39,86,40,95],[39,96,40,97],[42,0,58,1],[42,2,44,13],[42,14,44,49],[42,50,44,57],[42,58,44,73],[42,74,42,97],[43,74,43,83],[43,84,43,93],[43,94,43,97],[44,74,44,83],[44,84,44,93],[44,94,44,97],[45,2,46,13],[47,96,48,97],[45,84,46,93],[45,94,45,97],[46,58,46,60],[46,61,46,73],[46,94,46,97],[45,14,46,49],[45,50,46,57],[47,14,48,73],[47,74,48,85],[47,86,48,95],[45,58,45,60],[45,61,45,73],[45,74,46,83],[53,2,58,13],[53,14,58,73],[53,74,54,85],[53,86,54,95],[51,86,52,95],[47,2,48,13],[53,96,54,97],[55,74,56,85],[55,86,56,95],[55,96,56,97],[57,74,58,85],[57,86,58,95],[57,96,58,97],[49,2,52,13],[49,14,52,73],[49,74,50,85],[49,86,50,95],[49,96,50,97],[51,74,52,85],[51,96,52,97]]}
["⑧",null,null,null,null,null,null,null,"デジタルカット",null,null,null,null,null,null,null,null,null,null,null,null,null,null,null,null,null,null,null,null,null,null,null,null,null,null,null,null,null,null,null,null,"受付店",null,null,null,null,null,null,null,"受付番号",null,null,null,null,null,null,null,null,null,null,null,null,null,null,null,null,null,null,null,null,null,null,null,null,null,null,null,null,null,null,null,null,null,null,null,null,"受付枚数"]
[null,null,null,null,null,null,null,null,null,null,null,null,null,null,null,null,null,null,null,null,null,null,null,null,null,null,null,null,null,null,null,null,null,null,null,null,null,null,null,null,null,{"$f":"INDEX('（0）作業受付票'!$AP$2,)","v":"　"}]
[null,null,null,null,null,null,null,null,null,null,null,null,null,null,null,null,null,null,null,null,null,null,null,null,null,null,null,null,null,null,null,null,null,null,null,null,null,null,null,null,null,null,null,null,null,null,null,null,null,"受付日",null,null,null,null,null,"年　　　　　月　　　　　日　　　　　時　　　　　分"]
[]
["会社名",null,null,null,null,null,null,null,{"$f":"INDEX('（0）作業受付票'!$M$5,)","v":""},null,null,null,null,null,null,null,null,null,null,null,null,null,null,null,null,null,null,null,null,null,null,null,null,"番組名",null,null,null,null,null,null,null,{"$f":"INDEX('（0）作業受付票'!$M$9,)","v":""},null,null,null,null,null,null,null,null,null,null,null,null,null,null,null,null,null,null,null,null,null,null,null,null,"お名前",null,null,null,null,null,null,null,{"$f":"INDEX('（0）作業受付票'!$BN$11,)","v":""}]
[]
[1,null,"受けテープ・メディアの種類",null,null,null,null,null,null,null,null,null,null,null,null,null,null,null,null,null,null,null,null,null,null,null,null,null,null,null,null,null,null,null,null,null,null,null,null,null,null,null,null,null,null,null,null,null,null,null,"受け\n消去確認",null,null,null,null,null,null,null,null,null,null,null,null,null,null,null,null,null,null,null,null,null,null,null,"▼  ▼  ▼  弊社使用欄  ▼  ▼  ▼"]
[null,null,null,null,null,null,null,null,null,null,null,null,null,null,null,null,null,null,null,null,null,null,null,null,null,null,null,null,null,null,null,null,null,null,null,null,null,null,null,null,null,null,null,null,null,null,null,null,null,null,null,null,null,null,null,null,null,null,null,null,null,null,null,null,null,null,null,null,null,null,null,null,null,null,"機械的",null,null,null,null,null,null,null,null,null,"人的",null,null,null,null,null,null,null,null,null,"作業者"]
[null,null,null,null,null,null,null,null,null,null,null,null,null,null,null,null,null,null,null,null,null,null,null,null,null,null,null,null,null,null,null,null,null,null,null,null,null,null,null,null,null,null,null,null,null,null,null,null,null,null,null,null,null,null,null,null,null,null,null,null,null,null,null,null,null,null,null,null,null,null,null,null,null,null,"A　　　　B",null,null,null,null,null,null,null,null,null,"A　　　　B"]
[null,null,"プロジェクト名",null,null,null,null,null,null,null,null,null,null,null,null,null,null,null,null,null,null,null,null,null,null,null,null,null,null,null,null,null,null,null,null,null,null,null,null,null,null,null,null,null,null,null,null,null,null,null,"キューシート",null,null,null,null,null,null,null,"□",null,null,"不要"]
[null,null,null,null,null,null,null,null,null,null,null,null,null,null,null,null,null,null,null,null,null,null,null,null,null,null,null,null,null,null,null,null,null,null,null,null,null,null,null,null,null,null,null,null,null,null,null,null,null,null,null,null,null,null,null,null,null,null,"□",null,null,"必要(1,000円)"]
[null,null,"シーケンス名\n(ファイル名)",null,null,null,null,null,null,null,null,null,null,null,null,null,null,null,null,null,null,null,null,null,null,null,null,null,null,null,null,null,null,null,null,null,null,null,null,null,null,null,null,null,null,null,null,null,null,null,null,null,null,null,null,null,null,null,null,null,null,null,null,null,null,null,null,null,null,null,null,null,null,null,"映像尺(分)",null,null,null,null,null,null,null,null,null,null,null,null,null,null,null,null,null,null,null,null,null,"分"]
[]
[null,null,"貼付ラベル名",null,null,null,null,null,null,null,null,null,null,null,null,null,null,null,null,null,null,null,null,null,null,null,null,null,null,null,null,null,null,null,null,null,null,null,null,null,null,null,null,null,null,null,null,null,null,null,null,null,null,null,null,null,null,null,null,null,null,null,null,null,null,null,null,null,null,null,null,null,null,null,"レンダリング時間(分)",null,null,null,null,null,null,null,null,null,null,null,null,null,null,null,null,null,null,null,null,null,"分"]
[]
[null,null,null,null,null,null,null,null,null,null,null,null,null,null,null,null,null,null,null,null,null,null,null,null,null,null,null,null,null,null,null,null,null,null,null,null,null,null,null,null,null,null,null,null,null,null,null,null,null,null,null,null,null,null,null,null,null,null,null,null,null,null,null,null,null,null,null,null,null,null,null,null,null,null,"キューシート作成\n(1,000円/枚)",null,null,null,null,null,null,null,null,null,null,null,null,null,null,null,null,null,null,null,null,null,"枚"]
[]
[null,null,"設定内容・備考\n\nTC生かし・引き直し\n音声\nのりしろ\nダウンコンバート形式\nTC焼付",null,null,null,null,null,null,null,null,null,null,null,null,null,null,null,null,null,null,null,null,null,null,null,null,null,null,null,null,null,null,null,null,null,null,null,null,null,null,null,null,null,null,null,null,null,null,null,null,null,null,null,null,null,null,null,null,null,null,null,null,null,null,null,null,null,null,null,null,null,null,null,"キューシート複製\n(476円/枚)",null,null,null,null,null,null,null,null,null,null,null,null,null,null,null,null,null,null,null,null,null,"枚"]
[]
[null,null,null,null,null,null,null,null,null,null,null,null,null,null,null,null,null,null,null,null,null,null,null,null,null,null,null,null,null,null,null,null,null,null,null,null,null,null,null,null,null,null,null,null,null,null,null,null,null,null,null,null,null,null,null,null,null,null,null,null,null,null,null,null,null,null,null,null,null,null,null,null,null,null,"DVD複製\n(476円/枚)",null,null,null,null,null,null,null,null,null,null,null,null,null,null,null,null,null,null,null,null,null,"枚"]
[]
[null,null,null,null,null,null,null,null,null,null,null,null,null,null,null,null,null,null,null,null,null,null,null,null,null,null,null,null,null,null,null,null,null,null,null,null,null,null,null,null,null,null,null,null,null,null,null,null,null,null,null,null,null,null,null,null,null,null,null,null,null,null,null,null,null,null,null,null,null,null,null,null,null,null,"Blu-ray複製\n(952円/枚)",null,null,null,null,null,null,null,null,null,null,null,null,null,null,null,null,null,null,null,null,null,"枚"]
[]
[]
[2,null,"受けテープ・メディアの種類",null,null,null,null,null,null,null,null,null,null,null,null,null,null,null,null,null,null,null,null,null,null,null,null,null,null,null,null,null,null,null,null,null,null,null,null,null,null,null,null,null,null,null,null,null,null,null,"受け\n消去確認",null,null,null,null,null,null,null,null,null,null,null,null,null,null,null,null,null,null,null,null,null,null,null,"▼  ▼  ▼  弊社使用欄  ▼  ▼  ▼"]
[null,null,null,null,null,null,null,null,null,null,null,null,null,null,null,null,null,null,null,null,null,null,null,null,null,null,null,null,null,null,null,null,null,null,null,null,null,null,null,null,null,null,null,null,null,null,null,null,null,null,null,null,null,null,null,null,null,null,null,null,null,null,null,null,null,null,null,null,null,null,null,null,null,null,"機械的",null,null,null,null,null,null,null,null,null,"人的",null,null,null,null,null,null,null,null,null,"作業者"]
[null,null,null,null,null,null,null,null,null,null,null,null,null,null,null,null,null,null,null,null,null,null,null,null,null,null,null,null,null,null,null,null,null,null,null,null,null,null,null,null,null,null,null,null,null,null,null,null,null,null,null,null,null,null,null,null,null,null,null,null,null,null,null,null,null,null,null,null,null,null,null,null,null,null,"A　　　　B",null,null,null,null,null,null,null,null,null,"A　　　　B"]
[null,null,"プロジェクト名",null,null,null,null,null,null,null,null,null,null,null,null,null,null,null,null,null,null,null,null,null,null,null,null,null,null,null,null,null,null,null,null,null,null,null,null,null,null,null,null,null,null,null,null,null,null,null,"キューシート",null,null,null,null,null,null,null,"□",null,null,"不要"]
[null,null,null,null,null,null,null,null,null,null,null,null,null,null,null,null,null,null,null,null,null,null,null,null,null,null,null,null,null,null,null,null,null,null,null,null,null,null,null,null,null,null,null,null,null,null,null,null,null,null,null,null,null,null,null,null,null,null,"□",null,null,"必要(1,000円)"]
[null,null,"シーケンス名\n(ファイル名)",null,null,null,null,null,null,null,null,null,null,null,null,null,null,null,null,null,null,null,null,null,null,null,null,null,null,null,null,null,null,null,null,null,null,null,null,null,null,null,null,null,null,null,null,null,null,null,null,null,null,null,null,null,null,null,null,null,null,null,null,null,null,null,null,null,null,null,null,null,null,null,"映像尺(分)",null,null,null,null,null,null,null,null,null,null,null,null,null,null,null,null,null,null,null,null,null,"分"]
{"$rows_left_out":30}