{"text_format":"1","workbook":"xlsx","n_sheets":2,"sheets":["【0】作業受付票","【2】Final Cut PRO"],"not_rendered":{"charts":0,"images":1,"macros":0,"external_links":0,"defined_names":0,"comments":0,"pivot_tables":0},"unopened":[],"bounds":{"document_bytes":16777216,"sheet_cells":100000,"rows_first":2000,"rows_last":500,"rows_between":2000,"halvings":0,"cell_chars":16384,"cell_head_chars":4096},"cells_cut":0,"cells_raw":0,"read":"whole","date_system":"1900"}

{"sheet":"【0】作業受付票","index":0,"n_rows":54,"n_cols":96,"rows_kept":54,"cut":false,"hidden":false,"merged":[[16,0,16,97],[18,84,21,97],[17,84,17,97],[12,12,15,48],[23,0,23,97],[24,0,27,12],[29,0,29,2],[29,3,29,15],[29,16,29,19],[18,70,21,83],[18,56,21,69],[18,42,21,55],[18,14,19,22],[18,23,19,31],[20,14,21,22],[20,23,21,41],[24,13,27,25],[24,26,25,34],[26,26,27,34],[24,35,25,97],[28,0,28,97],[29,20,29,48],[29,65,29,68],[29,69,29,97],[32,41,33,48],[32,49,33,62],[32,63,33,64],[34,63,35,64],[36,63,37,64],[33,0,33,8],[33,9,33,15],[35,0,35,8],[35,9,35,15],[37,0,37,8],[37,9,37,15],[40,79,41,89],[46,16,46,19],[46,20,46,48],[47,17,47,26],[38,63,39,64],[34,49,35,62],[36,49,37,62],[46,74,46,76],[30,90,31,97],[32,16,33,29],[34,65,35,78],[34,79,35,89],[32,79,33,89],[32,90,33,97],[36,90,37,97],[34,90,35,97],[30,79,31,89],[30,65,31,78],[30,49,31,62],[30,16,31,29],[30,63,31,64],[30,30,31,40],[32,65,33,78],[32,30,33,40],[46,3,46,15],[48,27,49,36],[44,41,45,48],[44,49,45,62],[45,0,45,8],[45,9,45,15],[47,0,47,6],[48,0,49,6],[38,65,39,78],[42,30,43,40],[44,30,45,40],[38,49,39,62],[40,41,41,48],[40,49,41,62],[38,16,39,29],[42,5,42,9],[42,10,42,15],[44,0,44,4],[44,5,44,9],[44,10,44,15],[39,0,39,8],[39,9,39,15],[41,0,41,8],[41,9,41,15],[51,16,51,18],[52,16,52,18],[52,19,52,26],[52,27,52,37],[51,19,51,26],[51,27,51,37],[47,53,47,73],[49,43,50,48],[49,37,50,42],[50,7,50,16],[50,17,50,26],[50,27,50,36],[53,0,53,23],[52,0,52,15],[51,0,51,2],[51,3,51,15],[53,27,54,97],[50,74,50,94],[50,95,50,97],[48,71,50,73],[44,65,45,78],[44,79,45,89],[44,90,45,97],[44,63,45,64],[48,74,49,76],[48,77,49,97],[47,95,47,97],[47,74,47,94],[47,43,48,48],[47,37,48,42],[47,7,47,16],[50,0,50,6],[47,49,47,52],[46,49,46,51],[46,52,46,73],[46,0,46,2],[53,24,54,26],[52,71,52,88],[52,89,52,97],[51,38,51,40],[51,41,51,58],[51,59,51,67],[52,38,52,40],[51,68,51,70],[51,89,51,97],[51,71,51,88],[52,68,52,70],[52,41,52,58],[52,59,52,67],[1,86,3,90],[1,93,3,97],[0,41,0,48],[1,41,3,48],[0,86,0,97],[0,49,3,54],[0,55,3,85],[42,63,43,64],[38,90,39,97],[40,65,41,78],[8,92,8,97],[9,92,9,97],[4,92,4,97],[5,92,5,97],[4,65,5,91],[8,65,9,88],[6,65,7,91],[8,89,9,91],[42,41,43,48],[42,49,43,62],[34,41,35,48],[17,42,17,55],[17,56,17,69],[17,70,17,83],[6,92,6,97],[7,92,7,97],[18,0,19,13],[20,0,21,13],[46,77,46,97],[48,49,50,70],[42,65,43,78],[42,79,43,89],[47,27,47,36],[44,16,45,29],[18,32,19,41],[14,65,15,97],[12,65,13,97],[10,65,11,94],[10,95,11,97],[40,90,41,97],[40,63,41,64],[42,90,43,97],[29,49,29,51],[29,52,29,64],[30,41,31,48],[48,7,49,16],[48,17,49,26],[34,30,35,40],[0,0,3,7],[32,0,32,4],[32,5,32,9],[32,10,32,15],[0,8,3,40],[8,0,11,11],[8,12,11,48],[14,59,15,64],[12,59,13,64],[10,59,11,64],[8,49,9,58],[8,59,9,64],[10,49,15,58],[26,35,27,40],[26,41,27,46],[26,47,27,52],[26,53,27,58],[26,59,27,97],[1,91,3,92],[4,0,7,11],[4,12,7,48],[4,49,7,58],[4,59,5,64],[6,59,7,64],[12,0,15,11],[30,0,30,4],[30,5,30,9],[30,10,30,15],[17,0,17,13],[17,14,17,41],[40,16,41,29],[42,16,43,29],[38,30,39,40],[38,41,39,48],[40,0,40,4],[40,5,40,9],[40,10,40,15],[40,30,41,40],[22,0,22,97],[38,79,39,89],[34,16,35,29],[36,16,37,29],[36,30,37,40],[36,41,37,48],[36,65,37,78],[36,79,37,89],[31,9,31,15],[31,0,31,8],[43,0,43,8],[43,9,43,15],[38,0,38,4],[38,5,38,9],[38,10,38,15],[34,0,34,4],[34,5,34,9],[34,10,34,15],[42,0,42,4],[36,0,36,4],[36,5,36,9],[36,10,36,15]]}
[0,null,null,null,null,null,null,null,"作業受付票（表紙）",null,null,null,null,null,null,null,null,null,null,null,null,null,null,null,null,null,null,null,null,null,null,null,null,null,null,null,null,null,null,null,null,"受付店",null,null,null,null,null,null,null,"受付日",null,null,null,null,null,"年　　　　　月　　　　　日　　　　　時　　　　　分",null,null,null,null,null,null,null,null,null,null,null,null,null,null,null,null,null,null,null,null,null,null,null,null,null,null,null,null,null,null,"受付枚数"]
[null,null,null,null,null,null,null,null,null,null,null,null,null,null,null,null,null,null,null,null,null,null,null,null,null,null,null,null,null,null,null,null,null,null,null,null,null,null,null,null,null,"　"]
[]
[]
["会社名\n(部署名)",null,null,null,null,null,null,null,null,null,null,null,"",null,null,null,null,null,null,null,null,null,null,null,null,null,null,null,null,null,null,null,null,null,null,null,null,null,null,null,null,null,null,null,null,null,null,null,null,"\nご請求先",null,null,null,null,null,null,null,null,null,"会社名",null,null,null,null,null,null,null,null,null,null,null,null,null,null,null,null,null,null,null,null,null,null,null,null,null,null,null,null,null,null,null,null,"決済方法"]
[null,null,null,null,null,null,null,null,null,null,null,null,null,null,null,null,null,null,null,null,null,null,null,null,null,null,null,null,null,null,null,null,null,null,null,null,null,null,null,null,null,null,null,null,null,null,null,null,null,null,null,null,null,null,null,null,null,null,null,null,null,null,null,null,null,null,null,null,null,null,null,null,null,null,null,null,null,null,null,null,null,null,null,null,null,null,null,null,null,null,null,null,"請求以外の場合"]
[null,null,null,null,null,null,null,null,null,null,null,null,null,null,null,null,null,null,null,null,null,null,null,null,null,null,null,null,null,null,null,null,null,null,null,null,null,null,null,null,null,null,null,null,null,null,null,null,null,null,null,null,null,null,null,null,null,null,null,"部署名",null,null,null,null,null,null,null,null,null,null,null,null,null,null,null,null,null,null,null,null,null,null,null,null,null,null,null,null,null,null,null,null,"店頭クレカ"]
[null,null,null,null,null,null,null,null,null,null,null,null,null,null,null,null,null,null,null,null,null,null,null,null,null,null,null,null,null,null,null,null,null,null,null,null,null,null,null,null,null,null,null,null,null,null,null,null,null,null,null,null,null,null,null,null,null,null,null,null,null,null,null,null,null,null,null,null,null,null,null,null,null,null,null,null,null,null,null,null,null,null,null,null,null,null,null,null,null,null,null,null,"WEBクレカ"]
["番組名\n作品名",null,null,null,null,null,null,null,null,null,null,null,"",null,null,null,null,null,null,null,null,null,null,null,null,null,null,null,null,null,null,null,null,null,null,null,null,null,null,null,null,null,null,null,null,null,null,null,null,"ご指定がある場合のみ記入してください",null,null,null,null,null,null,null,null,null,"お名前",null,null,null,null,null,null,null,null,null,null,null,null,null,null,null,null,null,null,null,null,null,null,null,null,null,null,null,null,null,"様",null,null,"コンビニ振込"]
[null,null,null,null,null,null,null,null,null,null,null,null,null,null,null,null,null,null,null,null,null,null,null,null,null,null,null,null,null,null,null,null,null,null,null,null,null,null,null,null,null,null,null,null,null,null,null,null,null,null,null,null,null,null,null,null,null,null,null,null,null,null,null,null,null,null,null,null,null,null,null,null,null,null,null,null,null,null,null,null,null,null,null,null,null,null,null,null,null,null,null,null,"銀行振込"]
[null,null,null,null,null,null,null,null,null,null,null,null,null,null,null,null,null,null,null,null,null,null,null,null,null,null,null,null,null,null,null,null,null,null,null,null,null,null,null,null,null,null,null,null,null,null,null,null,null,"あなたの\nご連絡先",null,null,null,null,null,null,null,null,null,"お名前",null,null,null,null,null,"",null,null,null,null,null,null,null,null,null,null,null,null,null,null,null,null,null,null,null,null,null,null,null,null,null,null,null,null,null,"様"]
[]
["副題名",null,null,null,null,null,null,null,null,null,null,null,"",null,null,null,null,null,null,null,null,null,null,null,null,null,null,null,null,null,null,null,null,null,null,null,null,null,null,null,null,null,null,null,null,null,null,null,null,null,null,null,null,null,null,null,null,null,null,"ＴＥＬ",null,null,null,null,null,""]
[]
[null,null,null,null,null,null,null,null,null,null,null,null,null,null,null,null,null,null,null,null,null,null,null,null,null,null,null,null,null,null,null,null,null,null,null,null,null,null,null,null,null,null,null,null,null,null,null,null,null,null,null,null,null,null,null,null,null,null,null,"E-mail",null,null,null,null,null,""]
[]
[]
["納期",null,null,null,null,null,null,null,null,null,null,null,null,null,"終了連絡",null,null,null,null,null,null,null,null,null,null,null,null,null,null,null,null,null,null,null,null,null,null,null,null,null,null,null,"受付者",null,null,null,null,null,null,null,null,null,null,null,null,null,"集計者",null,null,null,null,null,null,null,null,null,null,null,null,null,"お客様引取サイン",null,null,null,null,null,null,null,null,null,null,null,null,null,"引渡者"]
["/",null,null,null,null,null,null,null,null,null,null,null,null,null,"不要",null,null,null,null,null,null,null,null,"メール",null,null,null,null,null,null,null,null,"電話(24h可)"]
[]
[":",null,null,null,null,null,null,null,null,null,null,null,null,null,"電話\n(時間指定)"]
[]
[]
["作業完了後の引取方法"]
["店頭引取",null,null,null,null,null,null,null,null,null,null,null,null,"作業後配送",null,null,null,null,null,null,null,null,null,null,null,null,"配送先"]
[]
[null,null,null,null,null,null,null,null,null,null,null,null,null,null,null,null,null,null,null,null,null,null,null,null,null,null,"配送区分",null,null,null,null,null,null,null,null,"10\n～12",null,null,null,null,null,"12\n～15",null,null,null,null,null,"15\n～17",null,null,null,null,null,"17\n～20",null,null,null,null,null,"配送担当者はお客様引渡後、上部の「引渡者」にサインしてください"]
[]
[]
["□",null,null,"デジタイズ",null,null,null,null,null,null,null,null,null,null,null,null,"受付\n番号",null,null,null,null,null,null,null,null,null,null,null,null,null,null,null,null,null,null,null,null,null,null,null,null,null,null,null,null,null,null,null,null,"□",null,null,"ワーク・アーカイブ",null,null,null,null,null,null,null,null,null,null,null,null,"受付\n番号"]
{"$rows_left_out":25}
{"sheet":"【2】Final Cut PRO","index":1,"n_rows":55,"n_cols":95,"rows_kept":55,"cut":false,"hidden":false,"merged":[[50,0,53,1],[50,2,53,9],[52,82,53,87],[52,88,53,93],[50,10,51,36],[50,37,51,48],[53,94,53,97],[50,66,50,79],[50,80,50,81],[50,82,50,83],[50,84,50,93],[50,94,50,97],[51,66,53,73],[51,74,53,81],[51,82,51,87],[51,88,51,93],[51,94,52,97],[50,49,53,65],[52,10,53,48],[46,94,46,97],[47,66,49,73],[47,74,49,81],[47,82,47,87],[47,88,47,93],[47,94,48,97],[48,82,49,87],[48,88,49,93],[49,94,49,97],[46,0,49,1],[46,2,49,9],[46,66,46,79],[46,80,46,81],[46,82,46,83],[46,84,46,93],[46,10,47,36],[46,37,47,48],[46,49,49,65],[48,10,49,48],[42,94,42,97],[43,66,45,73],[43,74,45,81],[43,82,43,87],[43,88,43,93],[43,94,44,97],[44,82,45,87],[44,88,45,93],[45,94,45,97],[42,0,45,1],[42,2,45,9],[42,66,42,79],[42,80,42,81],[42,82,42,83],[42,84,42,93],[42,10,43,36],[42,37,43,48],[42,49,45,65],[44,10,45,48],[38,94,38,97],[39,66,41,73],[39,74,41,81],[39,82,39,87],[39,88,39,93],[39,94,40,97],[40,82,41,87],[40,88,41,93],[41,94,41,97],[38,0,41,1],[38,2,41,9],[38,66,38,79],[38,80,38,81],[38,82,38,83],[38,84,38,93],[38,10,39,36],[38,37,39,48],[38,49,41,65],[40,10,41,48],[34,94,34,97],[35,66,37,73],[35,74,37,81],[35,82,35,87],[35,88,35,93],[35,94,36,97],[36,82,37,87],[36,88,37,93],[37,94,37,97],[34,0,37,1],[34,2,37,9],[34,66,34,79],[34,80,34,81],[34,82,34,83],[34,84,34,93],[34,10,35,36],[34,37,35,48],[34,49,37,65],[36,10,37,48],[30,94,30,97],[31,66,33,73],[31,74,33,81],[31,82,31,87],[31,88,31,93],[31,94,32,97],[32,82,33,87],[32,88,33,93],[33,94,33,97],[30,0,33,1],[30,2,33,9],[30,66,30,79],[30,80,30,81],[30,82,30,83],[30,84,30,93],[30,10,31,36],[30,37,31,48],[30,49,33,65],[32,10,33,48],[26,94,26,97],[27,66,29,73],[27,74,29,81],[27,82,27,87],[27,88,27,93],[27,94,28,97],[28,82,29,87],[28,88,29,93],[29,94,29,97],[26,0,29,1],[26,2,29,9],[26,66,26,79],[26,80,26,81],[26,82,26,83],[26,84,26,93],[26,10,27,36],[26,37,27,48],[26,49,29,65],[28,10,29,48],[22,94,22,97],[23,66,25,73],[23,74,25,81],[23,82,23,87],[23,88,23,93],[23,94,24,97],[24,82,25,87],[24,88,25,93],[25,94,25,97],[22,0,25,1],[22,2,25,9],[22,66,22,79],[22,80,22,81],[22,82,22,83],[22,84,22,93],[22,10,23,36],[22,37,23,48],[22,49,25,65],[24,10,25,48],[17,94,17,97],[18,0,21,1],[18,2,21,9],[18,66,18,79],[18,80,18,81],[18,82,18,83],[18,84,18,93],[18,10,19,36],[18,37,19,48],[18,49,21,65],[20,10,21,48],[18,94,18,97],[19,66,21,73],[19,74,21,81],[19,82,19,87],[19,88,19,93],[19,94,20,97],[20,82,21,87],[20,88,21,93],[21,94,21,97],[13,66,13,73],[13,74,13,81],[13,82,13,87],[13,88,13,93],[14,0,17,1],[14,2,17,9],[14,66,14,79],[10,0,13,1],[10,2,13,9],[10,66,10,97],[11,66,12,81],[11,82,12,93],[11,94,13,97],[14,80,14,81],[14,82,14,83],[14,84,14,93],[14,94,14,97],[15,66,17,73],[15,74,17,81],[15,82,15,87],[15,88,15,93],[15,94,16,97],[16,82,17,87],[16,88,17,93],[6,88,6,97],[7,68,8,77],[7,78,8,87],[7,88,8,97],[8,0,9,3],[8,4,9,17],[8,60,9,67],[9,68,9,77],[9,78,9,87],[9,88,9,97],[6,0,7,3],[6,4,7,17],[6,18,9,41],[6,42,9,50],[6,51,9,59],[6,60,7,67],[6,68,6,77],[6,78,6,87],[5,42,5,50],[5,51,5,59],[5,60,5,67],[5,68,5,77],[0,86,0,97],[0,8,1,40],[0,41,0,48],[0,49,1,54],[0,55,1,85],[1,41,3,48],[1,86,3,90],[1,91,3,92],[5,78,5,87],[5,88,5,97],[54,0,54,23],[54,24,55,32],[54,33,55,97],[1,93,3,97],[2,8,3,40],[2,49,3,54],[2,55,3,85],[10,10,11,36],[10,37,11,48],[10,49,13,65],[12,10,13,48],[14,10,15,36],[14,37,15,48],[14,49,17,65],[16,10,17,48],[4,0,4,7],[4,8,4,32],[4,33,4,40],[4,41,4,65],[4,66,4,73],[4,74,4,97],[0,0,3,7],[5,0,5,23],[5,24,5,41]]}
["②",null,null,null,null,null,null,null,"デジタイズ・データ変換",null,null,null,null,null,null,null,null,null,null,null,null,null,null,null,null,null,null,null,null,null,null,null,null,null,null,null,null,null,null,null,null,"受付店",null,null,null,null,null,null,null,"受付番号",null,null,null,null,null,null,null,null,null,null,null,null,null,null,null,null,null,null,null,null,null,null,null,null,null,null,null,null,null,null,null,null,null,null,null,null,"受付枚数"]
[null,null,null,null,null,null,null,null,null,null,null,null,null,null,null,null,null,null,null,null,null,null,null,null,null,null,null,null,null,null,null,null,null,null,null,null,null,null,null,null,null,{"$f":"INDEX(【0】作業受付票!$AP$2,)","v":"　"}]
[null,null,null,null,null,null,null,null,"Final Cut PRO",null,null,null,null,null,null,null,null,null,null,null,null,null,null,null,null,null,null,null,null,null,null,null,null,null,null,null,null,null,null,null,null,null,null,null,null,null,null,null,null,"受付日",null,null,null,null,null,"年　　　　　月　　　　　日　　　　　時　　　　　分"]
[]
["会社名",null,null,null,null,null,null,null,{"$f":"INDEX(【0】作業受付票!$M$5,)","v":""},null,null,null,null,null,null,null,null,null,null,null,null,null,null,null,null,null,null,null,null,null,null,null,null,"番組名",null,null,null,null,null,null,null,{"$f":"INDEX(【0】作業受付票!$M$9,)","v":""},null,null,null,null,null,null,null,null,null,null,null,null,null,null,null,null,null,null,null,null,null,null,null,null,"お名前",null,null,null,null,null,null,null,{"$f":"INDEX(【0】作業受付票!$BN$11,)","v":""}]
["取込形式",null,null,null,null,null,null,null,null,null,null,null,null,null,null,null,null,null,null,null,null,null,null,null,"その他設定・形式・ch数など",null,null,null,null,null,null,null,null,null,null,null,null,null,null,null,null,null,"フレームサイズ",null,null,null,null,null,null,null,null,"フレームレート",null,null,null,null,null,null,null,null,"メディア\nバックアップ",null,null,null,null,null,null,null,"受けHDD",null,null,null,null,null,null,null,null,null,"HDD\nフォーマット形式",null,null,null,null,null,null,null,null,null,"TOCレンタル\nメディアの処理"]
["HD",null,null,null,"□ ProRes422(SQ)\n□ HDV圧縮",null,null,null,null,null,null,null,null,null,null,null,null,null,null,null,null,null,null,null,null,null,null,null,null,null,null,null,null,null,null,null,null,null,null,null,null,null,null,null,null,null,null,null,null,null,null,null,null,null,null,null,null,null,null,null,"取る\n(有料)",null,null,null,null,null,null,null,"新規レンタル",null,null,null,null,null,null,null,null,null,"Mac(HFS+)",null,null,null,null,null,null,null,null,null,"作業後返却"]
[null,null,null,null,null,null,null,null,null,null,null,null,null,null,null,null,null,null,null,null,null,null,null,null,null,null,null,null,null,null,null,null,null,null,null,null,null,null,null,null,null,null,null,null,null,null,null,null,null,null,null,null,null,null,null,null,null,null,null,null,null,null,null,null,null,null,null,null,"消去NG(持込)",null,null,null,null,null,null,null,null,null,"Win(NTFS)",null,null,null,null,null,null,null,null,null,"レンタル継続"]
["SD",null,null,null,"□ DV圧縮",null,null,null,null,null,null,null,null,null,null,null,null,null,null,null,null,null,null,null,null,null,null,null,null,null,null,null,null,null,null,null,null,null,null,null,null,null,null,null,null,null,null,null,null,null,null,null,null,null,null,null,null,null,null,null,"不要"]
[null,null,null,null,null,null,null,null,null,null,null,null,null,null,null,null,null,null,null,null,null,null,null,null,null,null,null,null,null,null,null,null,null,null,null,null,null,null,null,null,null,null,null,null,null,null,null,null,null,null,null,null,null,null,null,null,null,null,null,null,null,null,null,null,null,null,null,null,"消去OK(持込)",null,null,null,null,null,null,null,null,null,"exFAT",null,null,null,null,null,null,null,null,null,"未定"]
[null,null,"メディア・\nテープの\n種類名",null,null,null,null,null,null,null,"ラベル名\n(作業者が判別できる範囲で)",null,null,null,null,null,null,null,null,null,null,null,null,null,null,null,null,null,null,null,null,null,null,null,null,null,null,"テープ番号\n(英数6桁)",null,null,null,null,null,null,null,null,null,null,null,"備考\n(収録形式・変換時間)",null,null,null,null,null,null,null,null,null,null,null,null,null,null,null,null,"▼  ▼  ▼  弊社使用欄  ▼  ▼  ▼"]
[null,null,null,null,null,null,null,null,null,null,null,null,null,null,null,null,null,null,null,null,null,null,null,null,null,null,null,null,null,null,null,null,null,null,null,null,null,null,null,null,null,null,null,null,null,null,null,null,null,null,null,null,null,null,null,null,null,null,null,null,null,null,null,null,null,null,"尺(分)",null,null,null,null,null,null,null,null,null,null,null,null,null,null,null,"メディアバックアップ",null,null,null,null,null,null,null,null,null,null,null,"作業者"]
[null,null,null,null,null,null,null,null,null,null,"取込後のファイル名 (簡潔にお願いします)"]
[null,null,null,null,null,null,null,null,null,null,null,null,null,null,null,null,null,null,null,null,null,null,null,null,null,null,null,null,null,null,null,null,null,null,null,null,null,null,null,null,null,null,null,null,null,null,null,null,null,null,null,null,null,null,null,null,null,null,null,null,null,null,null,null,null,null,"一時保存先",null,null,null,null,null,null,null,"最終保存先",null,null,null,null,null,null,null,"機械的",null,null,null,null,null,"人的"]
[1,null,null,null,null,null,null,null,null,null,null,null,null,null,null,null,null,null,null,null,null,null,null,null,null,null,null,null,null,null,null,null,null,null,null,null,null,null,null,null,null,null,null,null,null,null,null,null,null,null,null,null,null,null,null,null,null,null,null,null,null,null,null,null,null,null,null,null,null,null,null,null,null,null,null,null,null,null,null,null,"分",null,"C"]
[null,null,null,null,null,null,null,null,null,null,null,null,null,null,null,null,null,null,null,null,null,null,null,null,null,null,null,null,null,null,null,null,null,null,null,null,null,null,null,null,null,null,null,null,null,null,null,null,null,null,null,null,null,null,null,null,null,null,null,null,null,null,null,null,null,null,null,null,null,null,null,null,null,null,null,null,null,null,null,null,null,null,"A    B    C",null,null,null,null,null,"A     B"]
[]
[]
[2,null,null,null,null,null,null,null,null,null,null,null,null,null,null,null,null,null,null,null,null,null,null,null,null,null,null,null,null,null,null,null,null,null,null,null,null,null,null,null,null,null,null,null,null,null,null,null,null,null,null,null,null,null,null,null,null,null,null,null,null,null,null,null,null,null,null,null,null,null,null,null,null,null,null,null,null,null,null,null,"分",null,"C"]
[null,null,null,null,null,null,null,null,null,null,null,null,null,null,null,null,null,null,null,null,null,null,null,null,null,null,null,null,null,null,null,null,null,null,null,null,null,null,null,null,null,null,null,null,null,null,null,null,null,null,null,null,null,null,null,null,null,null,null,null,null,null,null,null,null,null,null,null,null,null,null,null,null,null,null,null,null,null,null,null,null,null,"A    B    C",null,null,null,null,null,"A     B"]
[]
[]
[3,null,null,null,null,null,null,null,null,null,null,null,null,null,null,null,null,null,null,null,null,null,null,null,null,null,null,null,null,null,null,null,null,null,null,null,null,null,null,null,null,null,null,null,null,null,null,null,null,null,null,null,null,null,null,null,null,null,null,null,null,null,null,null,null,null,null,null,null,null,null,null,null,null,null,null,null,null,null,null,"分",null,"C"]
[null,null,null,null,null,null,null,null,null,null,null,null,null,null,null,null,null,null,null,null,null,null,null,null,null,null,null,null,null,null,null,null,null,null,null,null,null,null,null,null,null,null,null,null,null,null,null,null,null,null,null,null,null,null,null,null,null,null,null,null,null,null,null,null,null,null,null,null,null,null,null,null,null,null,null,null,null,null,null,null,null,null,"A    B    C",null,null,null,null,null,"A     B"]
[]
[]
[4,null,null,null,null,null,null,null,null,null,null,null,null,null,null,null,null,null,null,null,null,null,null,null,null,null,null,null,null,null,null,null,null,null,null,null,null,null,null,null,null,null,null,null,null,null,null,null,null,null,null,null,null,null,null,null,null,null,null,null,null,null,null,null,null,null,null,null,null,null,null,null,null,null,null,null,null,null,null,null,"分",null,"C"]
[null,null,null,null,null,null,null,null,null,null,null,null,null,null,null,null,null,null,null,null,null,null,null,null,null,null,null,null,null,null,null,null,null,null,null,null,null,null,null,null,null,null,null,null,null,null,null,null,null,null,null,null,null,null,null,null,null,null,null,null,null,null,null,null,null,null,null,null,null,null,null,null,null,null,null,null,null,null,null,null,null,null,"A    B    C",null,null,null,null,null,"A     B"]
[]
[]
{"$rows_left_out":25}