{"text_format":"1","workbook":"xlsx","n_sheets":3,"sheets":["(0)作業受付票","個人情報の取扱いについて","集計用紙"],"not_rendered":{"charts":0,"images":3,"macros":1,"external_links":0,"defined_names":0,"comments":0,"pivot_tables":0},"unopened":[],"bounds":{"document_bytes":16777216,"sheet_cells":100000,"rows_first":2000,"rows_last":500,"rows_between":2000,"halvings":0,"cell_chars":16384,"cell_head_chars":4096},"cells_cut":0,"cells_raw":0,"read":"whole","date_system":"1900"}

{"sheet":"(0)作業受付票","index":0,"n_rows":49,"n_cols":71,"rows_kept":49,"cut":false,"hidden":false,"merged":[[24,0,24,71],[23,42,23,47],[22,0,23,9],[22,10,23,19],[47,51,47,65],[47,66,47,67],[47,68,47,71],[47,0,48,10],[47,11,47,12],[47,13,47,16],[47,17,47,23],[46,49,46,50],[46,51,46,65],[46,0,46,1],[46,2,46,10],[48,17,48,23],[48,24,48,25],[48,26,48,27],[48,28,48,42],[48,43,48,44],[23,40,23,41],[23,48,23,51],[23,52,23,55],[23,56,23,59],[23,68,23,71],[23,64,23,67],[23,60,23,63],[20,0,20,9],[17,57,17,59],[17,0,17,5],[19,52,20,61],[19,0,19,9],[18,62,18,71],[18,0,18,9],[18,10,18,31],[18,32,18,41],[17,25,17,34],[17,51,17,56],[17,45,17,50],[17,35,17,39],[17,40,17,44],[18,42,18,51],[18,52,18,61],[16,4,16,9],[4,0,16,3],[4,10,7,35],[8,10,11,35],[12,10,15,35],[4,36,7,41],[8,36,9,41],[13,36,15,41],[10,36,12,41],[16,10,16,59],[4,4,7,9],[8,4,11,9],[12,4,15,9],[4,47,5,71],[10,42,11,46],[8,70,9,71],[10,70,11,71],[6,47,7,71],[10,47,11,69],[16,63,16,71],[16,60,16,62],[0,0,3,5],[0,6,3,29],[2,36,3,41],[0,30,0,35],[1,30,3,35],[12,42,13,46],[14,42,15,46],[6,42,7,46],[8,42,9,46],[0,42,1,64],[2,42,3,64],[8,47,9,69],[0,65,0,71],[1,69,3,71],[1,68,3,68],[1,65,3,67],[0,36,1,41],[4,42,5,46],[12,47,13,71],[14,47,15,71],[48,68,48,71],[46,11,46,12],[46,13,46,16],[46,17,46,23],[46,24,46,25],[46,26,46,27],[46,28,46,42],[46,43,46,44],[47,28,47,42],[47,43,47,44],[47,45,47,48],[47,49,47,50],[48,11,48,12],[48,13,48,16],[47,24,47,25],[47,26,47,27],[46,45,46,48],[46,66,46,67],[46,68,46,71],[48,45,48,48],[48,49,48,50],[48,51,48,65],[48,66,48,67],[42,2,45,10],[42,0,45,1],[42,11,45,71],[25,0,41,71],[17,6,17,12],[17,19,17,24],[17,70,17,71],[17,60,17,69],[19,62,20,71],[19,10,19,16],[19,17,19,23],[19,24,19,31],[20,10,20,16],[20,17,20,31],[19,32,20,41],[19,42,20,51],[17,13,17,18],[21,0,21,71],[22,20,22,25],[23,20,23,25],[22,26,22,71],[23,26,23,31],[23,32,23,33],[23,34,23,39]]}
[0,null,null,null,null,null,"作業受付票(表紙)",null,null,null,null,null,null,null,null,null,null,null,null,null,null,null,null,null,null,null,null,null,null,null,"受付店",null,null,null,null,null,"受付番号",null,null,null,null,null,"",null,null,null,null,null,null,null,null,null,null,null,null,null,null,null,null,null,null,null,null,null,null,"受付枚数"]
[null,null,null,null,null,null,null,null,null,null,null,null,null,null,null,null,null,null,null,null,null,null,null,null,null,null,null,null,null,null,"　"]
[null,null,null,null,null,null,null,null,null,null,null,null,null,null,null,null,null,null,null,null,null,null,null,null,null,null,null,null,null,null,null,null,null,null,null,null,"受付日時",null,null,null,null,null,"年　　　　　月　　　　　日　　　　　時　　　　　分"]
[]
["お客様記入欄",null,null,null,"会社名\n(部署名)",null,null,null,null,null,"",null,null,null,null,null,null,null,null,null,null,null,null,null,null,null,null,null,null,null,null,null,null,null,null,null,"\nご請求先",null,null,null,null,null,"会社名",null,null,null,null,""]
[]
[null,null,null,null,null,null,null,null,null,null,null,null,null,null,null,null,null,null,null,null,null,null,null,null,null,null,null,null,null,null,null,null,null,null,null,null,null,null,null,null,null,null,"部署名",null,null,null,null,""]
[]
[null,null,null,null,"番組名\n作品名\n案件名",null,null,null,null,null,"",null,null,null,null,null,null,null,null,null,null,null,null,null,null,null,null,null,null,null,null,null,null,null,null,null,"ご指定が\nある場合のみ",null,null,null,null,null,"お名前\nフルネーム必須",null,null,null,null,"",null,null,null,null,null,null,null,null,null,null,null,null,null,null,null,null,null,null,null,null,null,null,"様"]
[]
[null,null,null,null,null,null,null,null,null,null,null,null,null,null,null,null,null,null,null,null,null,null,null,null,null,null,null,null,null,null,null,null,null,null,null,null,"あなたの\nご連絡先",null,null,null,null,null,"お名前",null,null,null,null,"",null,null,null,null,null,null,null,null,null,null,null,null,null,null,null,null,null,null,null,null,null,null,"様"]
[]
[null,null,null,null,"副題名\n制作番号\n作品番号\nCRナンバー",null,null,null,null,null,"",null,null,null,null,null,null,null,null,null,null,null,null,null,null,null,null,null,null,null,null,null,null,null,null,null,null,null,null,null,null,null,"電話番号\nご連絡が\n取れる番号",null,null,null,null,""]
[null,null,null,null,null,null,null,null,null,null,null,null,null,null,null,null,null,null,null,null,null,null,null,null,null,null,null,null,null,null,null,null,null,null,null,null,"E-mailは\n連絡を希望される\n場合のみ"]
[null,null,null,null,null,null,null,null,null,null,null,null,null,null,null,null,null,null,null,null,null,null,null,null,null,null,null,null,null,null,null,null,null,null,null,null,null,null,null,null,null,null,"E-mail",null,null,null,null,""]
[]
[null,null,null,null,"免責事項",null,null,null,null,null,"・個人情報の取扱いについて同意する(「個人情報の取扱いについて」をご覧ください)\n・弊社では、作業トラブルによる事後の損害については一切のご負担を致しかねます。\n  また、お預かり中のメディア、HDD、SSD等の不具合につきましても同様とさせて頂きます。",null,null,null,null,null,null,null,null,null,null,null,null,null,null,null,null,null,null,null,null,null,null,null,null,null,null,null,null,null,null,null,null,null,null,null,null,null,null,null,null,null,null,null,null,null,null,null,null,null,null,null,null,"同意して申し込む"]
["決済方法",null,null,null,null,null,"請求書以外を\n希望される場合",null,null,null,null,null,null,"【店頭】\nクレジットカード",null,null,null,null,null,"【店頭】\n交通系IC",null,null,null,null,null,"【店頭】\nApplePay/ID/QUICpay",null,null,null,null,null,null,null,null,null,"【店頭】\nQRコード",null,null,null,null,"【WEB】\n銀行振込",null,null,null,null,"【WEB】\nクレジットカード",null,null,null,null,null,"【WEB】\nコンビニ(現金)",null,null,null,null,null,"税込",null,null,null,null,null,null,null,null,null,null,null,null,"円"]
["納期",null,null,null,null,null,null,null,null,null,"終了連絡",null,null,null,null,null,null,null,null,null,null,null,null,null,null,null,null,null,null,null,null,null,"受付者",null,null,null,null,null,null,null,null,null,"集計者",null,null,null,null,null,null,null,null,null,"お客様引取サイン",null,null,null,null,null,null,null,null,null,"引渡者"]
["/",null,null,null,null,null,null,null,null,null,"不要",null,null,null,null,null,null,"E-mail",null,null,null,null,null,null,"電話(24h可)"]
[":",null,null,null,null,null,null,null,null,null,"電話\n(時間指定)"]
["作業完了後の引取方法"]
["店頭引取",null,null,null,null,null,null,null,null,null,"作業後配送",null,null,null,null,null,null,null,null,null,"配送先"]
[null,null,null,null,null,null,null,null,null,null,null,null,null,null,null,null,null,null,null,null,"配送区分",null,null,null,null,null,null,null,null,null,null,null,"月",null,null,null,null,null,null,null,"日",null,"時間指定なし",null,null,null,null,null,"10～13",null,null,null,"13～18",null,null,null,"18～21",null,null,null,"21～24",null,null,null,"24～34",null,null,null,"30分"]
["備考"]
[]
[]
[]
[]
[]
{"$rows_left_out":20}
{"sheet":"個人情報の取扱いについて","index":1,"n_rows":1,"n_cols":1,"rows_kept":1,"cut":false,"hidden":false,"merged":[[0,0,0,18]]}
["必ずご確認ください"]

{"sheet":"集計用紙","index":2,"n_rows":53,"n_cols":71,"rows_kept":53,"cut":false,"hidden":false,"merged":[[7,0,8,2],[7,3,8,5],[11,0,12,2],[44,0,44,1],[44,2,44,8],[40,9,40,10],[40,11,40,17],[42,9,42,10],[42,11,42,17],[44,9,44,10],[44,11,44,17],[11,3,12,5],[13,0,14,2],[13,3,14,5],[15,0,16,2],[15,3,16,5],[13,13,14,16],[37,0,38,1],[27,0,28,0],[17,17,17,23],[18,17,18,18],[18,19,18,23],[37,20,38,26],[39,6,39,8],[14,17,14,18],[14,19,14,23],[17,6,18,12],[17,13,18,16],[5,27,6,29],[7,24,8,26],[7,27,8,29],[11,24,12,26],[11,27,12,29],[13,24,14,26],[13,27,14,29],[15,24,16,26],[15,27,16,29],[9,61,10,64],[9,65,9,71],[10,65,10,66],[10,67,10,71],[19,41,19,47],[9,48,10,50],[9,51,10,53],[17,3,18,5],[19,0,20,2],[19,3,20,5],[17,24,18,26],[17,27,18,29],[19,24,20,26],[19,27,20,29],[17,30,18,36],[17,37,18,40],[19,30,20,36],[19,37,20,40],[19,13,20,16],[19,17,19,23],[20,17,20,18],[20,19,20,23],[16,43,16,47],[13,17,13,23],[7,48,8,50],[7,51,8,53],[11,48,12,50],[11,51,12,53],[13,48,14,50],[13,51,14,53],[15,48,16,50],[15,51,16,53],[12,65,12,66],[13,54,14,60],[13,61,14,64],[13,65,13,71],[14,65,14,66],[14,67,14,71],[15,54,16,60],[15,61,16,64],[15,65,15,71],[16,65,16,66],[16,67,16,71],[12,67,12,71],[11,54,12,60],[11,61,12,64],[11,65,11,71],[9,54,10,60],[17,41,17,47],[18,41,18,42],[18,43,18,47],[8,19,8,23],[7,13,8,16],[7,6,8,12],[15,6,16,12],[15,13,16,16],[15,17,15,23],[16,17,16,18],[16,19,16,23],[8,43,8,47],[11,30,12,36],[11,37,12,40],[11,41,11,47],[12,41,12,42],[12,43,12,47],[13,30,14,36],[13,37,14,40],[13,41,13,47],[14,41,14,42],[14,43,14,47],[10,41,10,42],[10,43,10,47],[47,30,48,31],[11,17,11,23],[12,17,12,18],[12,19,12,23],[13,6,14,12],[10,17,10,18],[10,19,10,23],[47,32,48,35],[45,48,46,59],[37,36,38,37],[39,36,39,37],[40,36,40,37],[41,36,41,37],[42,27,42,35],[39,9,39,14],[39,15,39,17],[41,9,41,14],[41,15,41,17],[37,29,38,35],[39,27,39,35],[40,27,40,35],[41,27,41,35],[37,2,38,17],[37,18,38,19],[45,60,46,71],[46,36,46,47],[47,66,48,67],[47,68,48,71],[43,66,44,67],[43,68,44,71],[44,48,44,49],[44,60,44,61],[43,56,44,59],[43,60,43,61],[43,62,44,65],[43,42,44,43],[43,44,44,47],[44,36,44,37],[51,54,52,55],[51,56,52,57],[51,58,51,59],[51,60,52,65],[50,40,50,41],[50,58,50,59],[49,60,50,65],[51,66,52,67],[51,68,52,71],[52,58,52,59],[49,66,50,67],[49,68,50,71],[51,36,52,37],[51,38,52,39],[51,40,51,41],[51,42,52,47],[51,48,52,49],[51,50,52,53],[51,18,52,19],[51,20,52,21],[51,22,51,23],[51,24,52,29],[51,30,52,31],[51,32,52,35],[52,22,52,23],[52,40,52,41],[49,18,50,19],[49,20,50,21],[49,22,49,23],[49,24,50,29],[49,30,50,31],[49,32,50,35],[51,0,52,1],[51,2,52,3],[51,4,51,5],[51,6,52,11],[51,12,52,13],[51,14,52,17],[49,0,50,1],[49,2,50,3],[49,4,49,5],[49,6,50,11],[49,12,50,13],[49,14,50,17],[52,4,52,5],[50,4,50,5],[50,22,50,23],[49,36,50,37],[49,38,50,39],[49,40,49,41],[49,42,50,47],[49,48,50,49],[49,50,50,53],[49,54,50,55],[49,56,50,57],[49,58,49,59],[47,0,48,1],[47,2,48,3],[47,4,47,5],[47,6,48,11],[47,12,48,13],[47,14,48,17],[47,56,48,57],[47,58,47,59],[47,60,48,65],[48,4,48,5],[48,22,48,23],[48,40,48,41],[48,58,48,59],[47,54,48,55],[47,18,48,19],[47,20,48,21],[47,22,47,23],[47,24,48,29],[47,36,48,37],[47,38,48,39],[47,40,47,41],[47,42,48,47],[47,48,48,49],[47,50,48,53],[45,0,45,1],[45,2,45,11],[45,12,46,23],[45,24,46,35],[45,36,45,37],[45,38,45,47],[43,48,43,49],[43,50,44,53],[43,54,44,55],[46,0,46,11],[44,27,44,35],[43,27,43,35],[43,0,43,5],[43,6,43,8],[43,9,43,14],[43,15,43,17],[44,18,44,26],[39,18,43,26],[40,0,40,1],[40,2,40,8],[42,0,42,1],[42,2,42,8],[43,36,43,37],[43,38,44,41],[37,60,38,61],[37,62,38,71],[39,66,40,67],[39,68,40,71],[40,48,40,49],[40,60,40,61],[41,54,42,55],[41,56,42,59],[41,68,42,71],[41,62,42,65],[42,48,42,49],[42,60,42,61],[41,48,41,49],[41,50,42,53],[41,60,41,61],[37,38,38,59],[39,38,40,41],[39,42,40,43],[39,44,40,47],[41,38,42,41],[41,42,42,43],[39,0,39,5],[41,0,41,5],[41,6,41,8],[35,36,36,46],[35,47,36,48],[35,49,36,59],[35,60,36,65],[35,66,35,68],[35,69,36,71],[36,66,36,68],[35,0,36,0],[35,1,35,5],[35,6,35,11],[35,12,36,23],[35,24,36,30],[35,31,36,35],[36,1,36,11],[39,48,39,49],[39,50,40,53],[39,54,40,55],[39,56,40,59],[39,60,39,61],[39,62,40,65],[41,66,42,67],[33,36,34,46],[33,47,34,48],[33,49,34,59],[33,60,34,65],[33,66,33,68],[33,69,34,71],[34,66,34,68],[33,0,34,0],[33,1,33,5],[33,6,33,11],[33,12,34,23],[33,24,34,30],[33,31,34,35],[34,1,34,11],[31,47,32,48],[31,49,32,59],[31,60,32,65],[31,66,31,68],[31,69,32,71],[32,66,32,68],[31,0,32,0],[31,1,31,5],[31,6,31,11],[31,12,32,23],[31,24,32,30],[31,31,32,35],[32,1,32,11],[31,36,32,46],[29,49,30,59],[29,60,30,65],[29,66,29,68],[29,69,30,71],[30,66,30,68],[29,0,30,0],[29,1,29,5],[29,6,29,11],[29,12,30,23],[29,24,30,30],[29,31,30,35],[30,1,30,11],[29,36,30,46],[29,47,30,48],[27,49,28,59],[27,60,28,65],[27,66,27,68],[27,69,28,71],[28,1,28,11],[28,66,28,68],[25,69,26,71],[26,1,26,11],[26,66,26,68],[25,47,26,48],[25,49,26,59],[25,60,26,65],[25,66,25,68],[27,1,27,5],[27,6,27,11],[27,12,28,23],[27,24,28,30],[27,31,28,35],[27,36,28,46],[25,31,26,35],[25,36,26,46],[27,47,28,48],[23,60,24,65],[23,66,23,68],[23,69,24,71],[24,1,24,11],[24,66,24,68],[25,0,26,0],[25,1,25,5],[25,6,25,11],[25,12,26,23],[25,24,26,30],[23,0,24,0],[23,1,23,5],[23,6,23,11],[23,12,24,23],[23,24,24,30],[23,31,24,35],[23,36,24,46],[23,47,24,48],[23,49,24,59],[21,50,22,71],[21,0,22,1],[21,2,22,8],[21,9,22,35],[21,36,22,37],[21,38,22,47],[21,48,22,49],[19,6,20,12],[17,54,18,60],[17,61,18,64],[17,65,17,71],[18,65,18,66],[18,67,18,71],[19,54,20,60],[19,61,20,64],[19,65,19,71],[20,65,20,66],[17,48,18,50],[17,51,18,53],[19,48,20,50],[20,67,20,71],[19,51,20,53],[20,41,20,42],[20,43,20,47],[6,65,6,66],[6,67,6,71],[7,17,7,23],[8,17,8,18],[2,42,3,64],[5,54,6,60],[5,61,6,64],[5,48,6,50],[5,51,6,53],[5,30,6,36],[5,37,6,40],[5,41,5,47],[6,41,6,42],[6,43,6,47],[7,30,8,36],[7,37,8,40],[7,41,7,47],[8,41,8,42],[7,54,8,60],[7,61,8,64],[7,65,7,71],[8,65,8,66],[8,67,8,71],[5,24,6,26],[0,65,0,71],[1,65,3,67],[1,68,3,68],[1,69,3,71],[4,70,4,71],[4,0,4,5],[4,6,4,23],[4,24,4,29],[4,30,4,47],[4,48,4,53],[4,54,4,69],[0,30,0,35],[0,36,1,41],[0,42,1,64],[1,30,3,35],[2,36,3,41],[5,0,6,1],[5,2,6,23],[37,27,38,28],[5,65,5,71],[0,0,3,29],[41,44,42,47],[42,36,42,37],[9,0,10,2],[9,3,10,5],[9,6,10,12],[9,13,10,16],[9,17,9,23],[9,24,10,26],[9,27,10,29],[9,30,10,36],[9,37,10,40],[9,41,9,47],[15,30,16,36],[15,37,16,40],[15,41,15,47],[16,41,16,42],[17,0,18,2],[11,6,12,12],[11,13,12,16]]}
["作業集計用紙",null,null,null,null,null,null,null,null,null,null,null,null,null,null,null,null,null,null,null,null,null,null,null,null,null,null,null,null,null,"受付店",null,null,null,null,null,"受付番号",null,null,null,null,null,{"$f":"INDEX('(0)作業受付票'!$AQ$1,)","v":""},null,null,null,null,null,null,null,null,null,null,null,null,null,null,null,null,null,null,null,null,null,null,"受付枚数"]
[null,null,null,null,null,null,null,null,null,null,null,null,null,null,null,null,null,null,null,null,null,null,null,null,null,null,null,null,null,null,{"$f":"INDEX('(0)作業受付票'!$AE$2,)","v":"　"}]
[null,null,null,null,null,null,null,null,null,null,null,null,null,null,null,null,null,null,null,null,null,null,null,null,null,null,null,null,null,null,null,null,null,null,null,null,"受付日時",null,null,null,null,null,"年　　　　　月　　　　　日　　　　　時　　　　　分"]
[]
["会社名",null,null,null,null,null,{"$f":"INDEX('(0)作業受付票'!$K$5,)","v":""},null,null,null,null,null,null,null,null,null,null,null,null,null,null,null,null,null,"番組名",null,null,null,null,null,{"$f":"INDEX('(0)作業受付票'!$K$9,)","v":""},null,null,null,null,null,null,null,null,null,null,null,null,null,null,null,null,null,"担当者名",null,null,null,null,null,{"$f":"INDEX('(0)作業受付票'!$AV$11,)","v":""},null,null,null,null,null,null,null,null,null,null,null,null,null,null,null,"様"]
["□",null,"変換作業 ・ プロキシ作成",null,null,null,null,null,null,null,null,null,null,null,null,null,null,null,null,null,null,null,null,null,"B",null,null,"P",null,null,"出し\n媒体名",null,null,null,null,null,null,"MOV\nMXF\nAvid",null,null,null,"請求尺",null,null,null,null,null,null,"B",null,null,"P",null,null,"出し\n媒体名",null,null,null,null,null,null,"MOV\nMXF\nAvid",null,null,null,"請求尺"]
[null,null,null,null,null,null,null,null,null,null,null,null,null,null,null,null,null,null,null,null,null,null,null,null,null,null,null,null,null,null,null,null,null,null,null,null,null,null,null,null,null,"×",null,"数量",null,null,null,null,null,null,null,null,null,null,null,null,null,null,null,null,null,null,null,null,null,"×",null,"数量"]
["B",null,null,"P",null,null,"出し\n媒体名",null,null,null,null,null,null,"MOV\nMXF\nAvid",null,null,null,"請求尺",null,null,null,null,null,null,"B",null,null,"P",null,null,"出し\n媒体名",null,null,null,null,null,null,"MOV\nMXF\nAvid",null,null,null,"請求尺",null,null,null,null,null,null,"B",null,null,"P",null,null,"出し\n媒体名",null,null,null,null,null,null,"MOV\nMXF\nAvid",null,null,null,"請求尺"]
[null,null,null,null,null,null,null,null,null,null,null,null,null,null,null,null,null,"×",null,"数量",null,null,null,null,null,null,null,null,null,null,null,null,null,null,null,null,null,null,null,null,null,"×",null,"数量",null,null,null,null,null,null,null,null,null,null,null,null,null,null,null,null,null,null,null,null,null,"×",null,"数量"]
["B",null,null,"P",null,null,"出し\n媒体名",null,null,null,null,null,null,"MOV\nMXF\nAvid",null,null,null,"請求尺",null,null,null,null,null,null,"B",null,null,"P",null,null,"出し\n媒体名",null,null,null,null,null,null,"MOV\nMXF\nAvid",null,null,null,"請求尺",null,null,null,null,null,null,"B",null,null,"P",null,null,"出し\n媒体名",null,null,null,null,null,null,"MOV\nMXF\nAvid",null,null,null,"請求尺"]
[null,null,null,null,null,null,null,null,null,null,null,null,null,null,null,null,null,"×",null,"数量",null,null,null,null,null,null,null,null,null,null,null,null,null,null,null,null,null,null,null,null,null,"×",null,"数量",null,null,null,null,null,null,null,null,null,null,null,null,null,null,null,null,null,null,null,null,null,"×",null,"数量"]
["B",null,null,"P",null,null,"出し\n媒体名",null,null,null,null,null,null,"MOV\nMXF\nAvid",null,null,null,"請求尺",null,null,null,null,null,null,"B",null,null,"P",null,null,"出し\n媒体名",null,null,null,null,null,null,"MOV\nMXF\nAvid",null,null,null,"請求尺",null,null,null,null,null,null,"B",null,null,"P",null,null,"出し\n媒体名",null,null,null,null,null,null,"MOV\nMXF\nAvid",null,null,null,"請求尺"]
[null,null,null,null,null,null,null,null,null,null,null,null,null,null,null,null,null,"×",null,"数量",null,null,null,null,null,null,null,null,null,null,null,null,null,null,null,null,null,null,null,null,null,"×",null,"数量",null,null,null,null,null,null,null,null,null,null,null,null,null,null,null,null,null,null,null,null,null,"×",null,"数量"]
["B",null,null,"P",null,null,"出し\n媒体名",null,null,null,null,null,null,"MOV\nMXF\nAvid",null,null,null,"請求尺",null,null,null,null,null,null,"B",null,null,"P",null,null,"出し\n媒体名",null,null,null,null,null,null,"MOV\nMXF\nAvid",null,null,null,"請求尺",null,null,null,null,null,null,"B",null,null,"P",null,null,"出し\n媒体名",null,null,null,null,null,null,"MOV\nMXF\nAvid",null,null,null,"請求尺"]
[null,null,null,null,null,null,null,null,null,null,null,null,null,null,null,null,null,"×",null,"数量",null,null,null,null,null,null,null,null,null,null,null,null,null,null,null,null,null,null,null,null,null,"×",null,"数量",null,null,null,null,null,null,null,null,null,null,null,null,null,null,null,null,null,null,null,null,null,"×",null,"数量"]
["B",null,null,"P",null,null,"出し\n媒体名",null,null,null,null,null,null,"MOV\nMXF\nAvid",null,null,null,"請求尺",null,null,null,null,null,null,"B",null,null,"P",null,null,"出し\n媒体名",null,null,null,null,null,null,"MOV\nMXF\nAvid",null,null,null,"請求尺",null,null,null,null,null,null,"B",null,null,"P",null,null,"出し\n媒体名",null,null,null,null,null,null,"MOV\nMXF\nAvid",null,null,null,"請求尺"]
[null,null,null,null,null,null,null,null,null,null,null,null,null,null,null,null,null,"×",null,"数量",null,null,null,null,null,null,null,null,null,null,null,null,null,null,null,null,null,null,null,null,null,"×",null,"数量",null,null,null,null,null,null,null,null,null,null,null,null,null,null,null,null,null,null,null,null,null,"×",null,"数量"]
["B",null,null,"P",null,null,"出し\n媒体名",null,null,null,null,null,null,"MOV\nMXF\nAvid",null,null,null,"請求尺",null,null,null,null,null,null,"B",null,null,"P",null,null,"出し\n媒体名",null,null,null,null,null,null,"MOV\nMXF\nAvid",null,null,null,"請求尺",null,null,null,null,null,null,"B",null,null,"P",null,null,"出し\n媒体名",null,null,null,null,null,null,"MOV\nMXF\nAvid",null,null,null,"請求尺"]
[null,null,null,null,null,null,null,null,null,null,null,null,null,null,null,null,null,"×",null,"数量",null,null,null,null,null,null,null,null,null,null,null,null,null,null,null,null,null,null,null,null,null,"×",null,"数量",null,null,null,null,null,null,null,null,null,null,null,null,null,null,null,null,null,null,null,null,null,"×",null,"数量"]
["B",null,null,"P",null,null,"出し\n媒体名",null,null,null,null,null,null,"MOV\nMXF\nAvid",null,null,null,"請求尺",null,null,null,null,null,null,"B",null,null,"P",null,null,"出し\n媒体名",null,null,null,null,null,null,"MOV\nMXF\nAvid",null,null,null,"請求尺",null,null,null,null,null,null,"B",null,null,"P",null,null,"出し\n媒体名",null,null,null,null,null,null,"MOV\nMXF\nAvid",null,null,null,"請求尺"]
[null,null,null,null,null,null,null,null,null,null,null,null,null,null,null,null,null,"×",null,"数量",null,null,null,null,null,null,null,null,null,null,null,null,null,null,null,null,null,null,null,null,null,"×",null,"数量",null,null,null,null,null,null,null,null,null,null,null,null,null,null,null,null,null,null,null,null,null,"×",null,"数量"]
["□",null,"デジタイズ",null,null,null,null,null,null,"XDCAMデータコピー及びリラップの場合は\n【XDCAMデータ】を選択してください",null,null,null,null,null,null,null,null,null,null,null,null,null,null,null,null,null,null,null,null,null,null,null,null,null,null,"□",null,"ダビング(ワーク)",null,null,null,null,null,null,null,null,null,"□",null,"アーカイブ"]
[]
[null,"□ XDCAM",null,null,null,null,"□ HDCAM",null,null,null,null,null,null,null,null,null,null,null,null,null,null,null,null,null,"分×",null,null,null,null,null,null,"本",null,null,null,null,"出し",null,null,null,null,null,null,null,null,null,null,"⇒",null,"受け",null,null,null,null,null,null,null,null,null,null,null,null,null,null,null,null,"分×"]
[null,"□ XDCAMデータ",null,null,null,null,null,null,null,null,null,null,null,null,null,null,null,null,null,null,null,null,null,null,null,null,null,null,null,null,null,null,null,null,null,null,null,null,null,null,null,null,null,null,null,null,null,null,null,null,null,null,null,null,null,null,null,null,null,null,null,null,null,null,null,null,"GB×"]
[null,"□ XDCAM",null,null,null,null,"□ HDCAM",null,null,null,null,null,null,null,null,null,null,null,null,null,null,null,null,null,"分×",null,null,null,null,null,null,"本",null,null,null,null,"出し",null,null,null,null,null,null,null,null,null,null,"⇒",null,"受け",null,null,null,null,null,null,null,null,null,null,null,null,null,null,null,null,"分×"]
[null,"□ XDCAMデータ",null,null,null,null,null,null,null,null,null,null,null,null,null,null,null,null,null,null,null,null,null,null,null,null,null,null,null,null,null,null,null,null,null,null,null,null,null,null,null,null,null,null,null,null,null,null,null,null,null,null,null,null,null,null,null,null,null,null,null,null,null,null,null,null,"GB×"]
[null,"□ XDCAM",null,null,null,null,"□ HDCAM",null,null,null,null,null,null,null,null,null,null,null,null,null,null,null,null,null,"分×",null,null,null,null,null,null,"本",null,null,null,null,"出し",null,null,null,null,null,null,null,null,null,null,"⇒",null,"受け",null,null,null,null,null,null,null,null,null,null,null,null,null,null,null,null,"分×"]
[null,"□ XDCAMデータ",null,null,null,null,null,null,null,null,null,null,null,null,null,null,null,null,null,null,null,null,null,null,null,null,null,null,null,null,null,null,null,null,null,null,null,null,null,null,null,null,null,null,null,null,null,null,null,null,null,null,null,null,null,null,null,null,null,null,null,null,null,null,null,null,"GB×"]
[null,"□ XDCAM",null,null,null,null,"□ HDCAM",null,null,null,null,null,null,null,null,null,null,null,null,null,null,null,null,null,"分×",null,null,null,null,null,null,"本",null,null,null,null,"出し",null,null,null,null,null,null,null,null,null,null,"⇒",null,"受け",null,null,null,null,null,null,null,null,null,null,null,null,null,null,null,null,"分×"]
{"$rows_left_out":23}