{"text_format":"1","workbook":"xlsx","n_sheets":2,"sheets":["(0)作業受付票","(9)特殊作業"],"not_rendered":{"charts":0,"images":2,"macros":1,"external_links":0,"defined_names":0,"comments":0,"pivot_tables":0},"unopened":[],"bounds":{"document_bytes":16777216,"sheet_cells":100000,"rows_first":2000,"rows_last":500,"rows_between":2000,"halvings":0,"cell_chars":16384,"cell_head_chars":4096},"cells_cut":0,"cells_raw":0,"read":"whole","date_system":"1900"}

{"sheet":"(0)作業受付票","index":0,"n_rows":53,"n_cols":71,"rows_kept":53,"cut":false,"hidden":false,"merged":[[49,70,49,71],[47,56,48,71],[46,70,46,71],[37,36,38,45],[37,46,38,47],[37,48,38,57],[39,36,40,45],[39,46,40,47],[39,48,40,57],[47,54,48,55],[46,54,46,69],[46,36,49,51],[46,52,49,53],[46,0,46,3],[46,4,46,11],[47,4,48,11],[49,4,49,11],[49,54,49,69],[31,36,32,45],[31,46,32,47],[33,48,34,57],[35,48,36,57],[51,47,51,48],[50,41,50,42],[51,41,51,42],[51,49,52,71],[51,28,51,40],[50,43,50,46],[51,43,51,46],[50,24,50,25],[51,24,51,25],[50,26,50,27],[51,26,51,27],[52,41,52,42],[52,43,52,46],[52,47,52,48],[50,47,50,48],[50,49,50,71],[51,0,52,9],[52,10,52,11],[46,31,47,35],[48,31,49,35],[51,12,51,16],[50,17,50,23],[51,17,51,23],[50,0,50,1],[50,2,50,9],[50,10,50,11],[51,10,51,11],[47,0,48,3],[49,0,49,3],[50,12,50,16],[49,20,49,27],[46,28,47,30],[48,28,49,30],[47,12,48,19],[49,12,49,19],[46,12,46,19],[46,20,46,27],[47,20,48,27],[50,28,50,40],[52,12,52,16],[35,58,36,65],[35,66,36,71],[45,38,45,53],[41,36,42,45],[41,46,42,47],[41,48,42,57],[43,36,44,45],[43,46,44,47],[43,48,44,57],[37,58,38,65],[37,66,38,71],[39,58,40,65],[39,66,40,71],[45,54,45,55],[45,56,45,71],[41,58,42,65],[41,66,42,71],[43,58,44,65],[43,66,44,71],[42,6,42,11],[43,0,43,3],[43,4,43,7],[43,8,43,11],[43,12,44,21],[43,22,44,29],[43,30,44,35],[41,30,42,35],[42,0,42,5],[41,4,41,7],[41,8,41,11],[41,12,42,21],[41,22,42,29],[45,10,45,35],[29,58,30,65],[29,66,30,71],[31,58,32,65],[31,66,32,71],[33,58,34,65],[33,66,34,71],[39,8,39,11],[39,12,40,21],[39,22,40,29],[35,30,36,35],[36,6,36,11],[37,4,37,7],[37,8,37,11],[37,12,38,21],[37,22,38,29],[37,30,38,35],[38,0,38,5],[31,8,31,11],[31,12,32,21],[33,46,34,47],[35,46,36,47],[29,36,30,45],[29,48,30,57],[29,46,30,47],[33,0,33,3],[28,0,28,1],[28,36,28,37],[31,48,32,57],[31,30,32,35],[32,0,32,5],[32,6,32,11],[31,0,31,3],[31,4,31,7],[28,2,28,35],[28,38,28,71],[34,6,34,11],[35,0,35,3],[35,4,35,7],[35,8,35,11],[35,12,36,21],[35,22,36,29],[33,4,33,7],[31,22,32,29],[29,12,30,21],[29,22,30,29],[36,0,36,5],[19,0,20,9],[21,0,22,9],[23,0,23,71],[24,0,27,9],[24,10,27,19],[24,20,25,25],[26,20,27,25],[24,26,25,71],[19,62,22,71],[19,10,20,16],[19,17,20,23],[19,24,20,31],[21,10,22,16],[21,17,22,31],[26,48,27,52],[26,53,27,57],[26,58,27,71],[26,26,27,31],[26,32,27,37],[26,38,27,42],[26,43,27,47],[19,32,22,41],[19,42,22,51],[0,0,3,5],[4,0,7,5],[8,0,11,5],[12,0,15,5],[0,6,3,29],[4,32,7,37],[8,32,9,37],[4,6,7,31],[8,6,11,31],[12,6,15,31],[2,36,3,41],[10,32,12,37],[13,32,15,37],[4,38,5,42],[6,38,7,42],[8,38,9,42],[10,38,11,42],[12,38,13,42],[14,38,15,42],[0,65,0,71],[1,69,3,71],[1,68,3,68],[1,65,3,67],[0,36,1,41],[0,30,0,35],[1,30,3,35],[0,42,1,64],[2,42,3,64],[52,17,52,23],[52,24,52,25],[52,26,52,27],[52,28,52,40],[33,12,34,21],[33,22,34,29],[44,0,44,5],[44,6,44,11],[33,8,33,11],[33,30,34,35],[34,0,34,5],[39,30,40,35],[40,0,40,5],[40,6,40,11],[41,0,41,3],[33,36,34,45],[38,6,38,11],[45,2,45,9],[35,36,36,45],[39,0,39,3],[39,4,39,7],[37,0,37,3],[45,0,45,1],[45,36,45,37],[7,68,8,71],[11,64,12,67],[11,68,12,71],[5,64,6,71],[9,64,10,71],[4,64,4,71],[29,30,30,35],[30,0,30,5],[30,6,30,11],[29,0,29,3],[29,4,29,7],[29,8,29,11],[18,62,18,71],[16,0,16,71],[18,0,18,9],[18,10,18,31],[18,32,18,41],[18,42,18,51],[18,52,18,61],[17,0,17,71],[13,64,13,71],[14,64,14,71],[15,64,15,71],[19,52,22,61],[4,43,5,63],[6,43,7,63],[12,43,13,63],[14,43,15,63],[8,62,9,63],[10,62,11,63],[8,43,9,61],[10,43,11,61],[7,64,8,67]]}
[0,null,null,null,null,null,"作業受付票(表紙)",null,null,null,null,null,null,null,null,null,null,null,null,null,null,null,null,null,null,null,null,null,null,null,"受付店",null,null,null,null,null,"受付番号",null,null,null,null,null,null,null,null,null,null,null,null,null,null,null,null,null,null,null,null,null,null,null,null,null,null,null,null,"受付枚数"]
[null,null,null,null,null,null,null,null,null,null,null,null,null,null,null,null,null,null,null,null,null,null,null,null,null,null,null,null,null,null,"　"]
[null,null,null,null,null,null,null,null,null,null,null,null,null,null,null,null,null,null,null,null,null,null,null,null,null,null,null,null,null,null,null,null,null,null,null,null,"受付日時",null,null,null,null,null,{"$f":"NOW()","v":"2019-08-02T19:23:41.580"}]
[]
["会社名\n(部署名)",null,null,null,null,null,"",null,null,null,null,null,null,null,null,null,null,null,null,null,null,null,null,null,null,null,null,null,null,null,null,null,"\nご請求先",null,null,null,null,null,"会社名",null,null,null,null,"",null,null,null,null,null,null,null,null,null,null,null,null,null,null,null,null,null,null,null,null,"決済方法"]
[null,null,null,null,null,null,null,null,null,null,null,null,null,null,null,null,null,null,null,null,null,null,null,null,null,null,null,null,null,null,null,null,null,null,null,null,null,null,null,null,null,null,null,null,null,null,null,null,null,null,null,null,null,null,null,null,null,null,null,null,null,null,null,null,"請求書以外を\n希望される場合"]
[null,null,null,null,null,null,null,null,null,null,null,null,null,null,null,null,null,null,null,null,null,null,null,null,null,null,null,null,null,null,null,null,null,null,null,null,null,null,"部署名",null,null,null,null,""]
[null,null,null,null,null,null,null,null,null,null,null,null,null,null,null,null,null,null,null,null,null,null,null,null,null,null,null,null,null,null,null,null,null,null,null,null,null,null,null,null,null,null,null,null,null,null,null,null,null,null,null,null,null,null,null,null,null,null,null,null,null,null,null,null,"【店頭】\nクレジット\nカード",null,null,null,"【店頭】\n交通系IC\n(Suica等)"]
["番組名\n作品名",null,null,null,null,null,"",null,null,null,null,null,null,null,null,null,null,null,null,null,null,null,null,null,null,null,null,null,null,null,null,null,"ご指定が\nある場合のみ",null,null,null,null,null,"お名前\nフルネーム必須",null,null,null,null,"",null,null,null,null,null,null,null,null,null,null,null,null,null,null,null,null,null,null,"様"]
[null,null,null,null,null,null,null,null,null,null,null,null,null,null,null,null,null,null,null,null,null,null,null,null,null,null,null,null,null,null,null,null,null,null,null,null,null,null,null,null,null,null,null,null,null,null,null,null,null,null,null,null,null,null,null,null,null,null,null,null,null,null,null,null,"【店頭】\nApplePay\nID / QUICPay"]
[null,null,null,null,null,null,null,null,null,null,null,null,null,null,null,null,null,null,null,null,null,null,null,null,null,null,null,null,null,null,null,null,"あなたの\nご連絡先",null,null,null,null,null,"お名前",null,null,null,null,"",null,null,null,null,null,null,null,null,null,null,null,null,null,null,null,null,null,null,"様"]
[null,null,null,null,null,null,null,null,null,null,null,null,null,null,null,null,null,null,null,null,null,null,null,null,null,null,null,null,null,null,null,null,null,null,null,null,null,null,null,null,null,null,null,null,null,null,null,null,null,null,null,null,null,null,null,null,null,null,null,null,null,null,null,null,"【WEB】\nクレジット\nカード",null,null,null,"【WEB】\nコンビニ\n(現金)"]
["副題名",null,null,null,null,null,"",null,null,null,null,null,null,null,null,null,null,null,null,null,null,null,null,null,null,null,null,null,null,null,null,null,null,null,null,null,null,null,"電話番号\nご連絡が\n取れる番号",null,null,null,null,""]
[null,null,null,null,null,null,null,null,null,null,null,null,null,null,null,null,null,null,null,null,null,null,null,null,null,null,null,null,null,null,null,null,"E-mailは\n連絡を希望される\n場合のみ",null,null,null,null,null,null,null,null,null,null,null,null,null,null,null,null,null,null,null,null,null,null,null,null,null,null,null,null,null,null,null,"税込"]
[null,null,null,null,null,null,null,null,null,null,null,null,null,null,null,null,null,null,null,null,null,null,null,null,null,null,null,null,null,null,null,null,null,null,null,null,null,null,"E-mail",null,null,null,null,""]
[null,null,null,null,null,null,null,null,null,null,null,null,null,null,null,null,null,null,null,null,null,null,null,null,null,null,null,null,null,null,null,null,null,null,null,null,null,null,null,null,null,null,null,null,null,null,null,null,null,null,null,null,null,null,null,null,null,null,null,null,null,null,null,null,"円"]
["▼ ▼ ▼ ▼ ▼ ▼ ▼ ▼ ▼　　　ここから下は弊社使用欄のため、記入しないでください　　　▼ ▼ ▼ ▼ ▼ ▼ ▼ ▼ ▼"]
[]
["納期",null,null,null,null,null,null,null,null,null,"終了連絡",null,null,null,null,null,null,null,null,null,null,null,null,null,null,null,null,null,null,null,null,null,"受付者",null,null,null,null,null,null,null,null,null,"集計者",null,null,null,null,null,null,null,null,null,"お客様引取サイン",null,null,null,null,null,null,null,null,null,"引渡者"]
["/",null,null,null,null,null,null,null,null,null,"不要",null,null,null,null,null,null,"E-mail",null,null,null,null,null,null,"電話(24h可)"]
[]
[":",null,null,null,null,null,null,null,null,null,"電話\n(時間指定)"]
[]
["作業完了後の引取方法"]
["店頭引取",null,null,null,null,null,null,null,null,null,"作業後配送",null,null,null,null,null,null,null,null,null,"配送先"]
[]
[null,null,null,null,null,null,null,null,null,null,null,null,null,null,null,null,null,null,null,null,"配送区分",null,null,null,null,null,"月",null,null,null,null,null,"日",null,null,null,null,null,"10～12",null,null,null,null,"12～15",null,null,null,null,"15～17",null,null,null,null,"17～20",null,null,null,null,"配送担当者はお客様引渡後\n上部の「引渡者」にサインしてください"]
[]
["□",null,"デジタイズ",null,null,null,null,null,null,null,null,null,null,null,null,null,null,null,null,null,null,null,null,null,null,null,null,null,null,null,null,null,null,null,null,null,"□",null,"ワーク・アーカイブ"]
["FCP",null,null,null,"Avid",null,null,null,"Edius",null,null,null,"テープの種類",null,null,null,null,null,null,null,null,null,"分×",null,null,null,null,null,null,null,"本",null,null,null,null,null,"出し",null,null,null,null,null,null,null,null,null,"⇒",null,"受け",null,null,null,null,null,null,null,null,null,"分×",null,null,null,null,null,null,null,"本"]
["Premiere",null,null,null,null,null,"Prunus"]
["FCP",null,null,null,"Avid",null,null,null,"Edius",null,null,null,"テープの種類",null,null,null,null,null,null,null,null,null,"分×",null,null,null,null,null,null,null,"本",null,null,null,null,null,"出し",null,null,null,null,null,null,null,null,null,"⇒",null,"受け",null,null,null,null,null,null,null,null,null,"分×",null,null,null,null,null,null,null,"本"]
["Premiere",null,null,null,null,null,"Prunus"]
["FCP",null,null,null,"Avid",null,null,null,"Edius",null,null,null,"テープの種類",null,null,null,null,null,null,null,null,null,"分×",null,null,null,null,null,null,null,"本",null,null,null,null,null,"出し",null,null,null,null,null,null,null,null,null,"⇒",null,"受け",null,null,null,null,null,null,null,null,null,"分×",null,null,null,null,null,null,null,"本"]
["Premiere",null,null,null,null,null,"Prunus"]
["FCP",null,null,null,"Avid",null,null,null,"Edius",null,null,null,"テープの種類",null,null,null,null,null,null,null,null,null,"分×",null,null,null,null,null,null,null,"本",null,null,null,null,null,"出し",null,null,null,null,null,null,null,null,null,"⇒",null,"受け",null,null,null,null,null,null,null,null,null,"分×",null,null,null,null,null,null,null,"本"]
["Premiere",null,null,null,null,null,"Prunus"]
["FCP",null,null,null,"Avid",null,null,null,"Edius",null,null,null,"テープの種類",null,null,null,null,null,null,null,null,null,"分×",null,null,null,null,null,null,null,"本",null,null,null,null,null,"出し",null,null,null,null,null,null,null,null,null,"⇒",null,"受け",null,null,null,null,null,null,null,null,null,"分×",null,null,null,null,null,null,null,"本"]
["Premiere",null,null,null,null,null,"Prunus"]
["FCP",null,null,null,"Avid",null,null,null,"Edius",null,null,null,"テープの種類",null,null,null,null,null,null,null,null,null,"分×",null,null,null,null,null,null,null,"本",null,null,null,null,null,"出し",null,null,null,null,null,null,null,null,null,"⇒",null,"受け",null,null,null,null,null,null,null,null,null,"分×",null,null,null,null,null,null,null,"本"]
{"$rows_left_out":14}
{"sheet":"(9)特殊作業","index":1,"n_rows":43,"n_cols":70,"rows_kept":43,"cut":false,"hidden":false,"merged":[[1,68,3,68],[1,69,3,71],[6,0,6,71],[38,61,40,66],[39,59,39,60],[40,59,40,60],[32,0,32,71],[26,0,26,71],[27,0,27,71],[5,0,5,71],[2,36,3,41],[2,42,3,64],[4,0,4,5],[4,6,4,23],[4,24,4,29],[4,30,4,47],[4,48,4,53],[4,54,4,71],[0,0,3,5],[0,6,3,29],[0,30,0,35],[0,36,1,41],[0,42,1,64],[0,65,0,71],[1,30,3,35],[1,65,3,67],[7,11,7,19],[7,20,7,27],[7,28,7,35],[8,0,9,8],[8,9,9,10],[8,11,9,19],[8,20,9,27],[8,28,9,35],[7,0,7,8],[15,0,15,71],[12,61,12,62],[12,63,12,68],[12,69,12,71],[13,61,13,62],[13,63,13,68],[13,69,13,71],[7,36,7,60],[8,36,9,60],[12,0,13,8],[12,9,13,10],[12,11,13,19],[12,20,13,27],[12,28,13,35],[12,36,13,60],[8,69,8,71],[7,69,7,71],[9,69,9,71],[7,61,7,68],[8,61,8,62],[8,63,8,68],[9,61,9,62],[9,63,9,68],[7,9,7,10],[16,69,16,71],[17,69,18,71],[16,61,16,68],[17,61,18,62],[17,63,18,68],[18,14,18,17],[17,18,17,21],[18,18,18,21],[17,22,17,25],[18,22,18,25],[17,26,17,35],[18,26,18,35],[17,14,17,17],[17,36,17,45],[18,36,18,45],[17,46,18,60],[16,36,16,45],[16,46,16,60],[16,6,16,35],[16,0,16,5],[17,0,18,5],[17,6,17,9],[18,6,18,9],[17,10,17,13],[18,10,18,13],[20,6,20,9],[20,10,20,13],[20,14,20,17],[20,18,20,21],[20,22,20,25],[20,26,20,35],[20,36,20,45],[19,22,19,25],[19,26,19,35],[19,36,19,45],[25,10,25,13],[25,14,25,17],[25,18,25,21],[21,0,21,71],[22,0,22,71],[23,36,23,45],[23,46,23,60],[23,61,23,68],[23,69,23,71],[19,0,20,5],[19,6,19,9],[19,10,19,13],[19,14,19,17],[19,18,19,21],[10,0,11,8],[10,9,11,10],[10,11,11,19],[10,20,11,27],[10,28,11,35],[10,36,11,60],[30,2,30,6],[29,7,30,24],[28,36,28,60],[29,36,29,37],[29,38,29,42],[29,43,30,60],[28,33,28,35],[29,33,29,35],[30,33,30,35],[28,25,28,32],[29,25,30,26],[29,27,30,32],[29,0,29,1],[30,0,30,1],[29,2,29,6],[28,0,28,24],[25,22,25,25],[25,26,25,35],[10,61,10,62],[10,63,10,68],[10,69,10,71],[11,61,11,62],[11,63,11,68],[11,69,11,71],[29,69,29,71],[30,36,30,37],[30,38,30,42],[30,69,30,71],[29,61,30,62],[29,63,30,68],[28,61,28,68],[28,69,28,71],[25,36,25,45],[24,36,24,45],[24,46,25,60],[24,61,25,62],[24,63,25,68],[24,69,25,71],[19,69,20,71],[19,46,20,60],[19,61,20,62],[19,63,20,68],[33,0,33,58],[34,0,40,58],[34,67,40,71],[42,0,51,1],[42,2,51,71],[14,0,14,71],[31,0,31,71],[41,0,41,71],[33,67,33,71],[33,59,33,66],[34,59,34,60],[35,59,35,60],[36,59,36,60],[34,61,36,66],[37,59,37,66],[38,59,38,60],[23,0,23,9],[24,0,25,9],[23,10,23,35],[24,26,24,35],[24,10,24,13],[24,14,24,17],[24,18,24,21],[24,22,24,25]]}
[9,null,null,null,null,null,"特殊作業",null,null,null,null,null,null,null,null,null,null,null,null,null,null,null,null,null,null,null,null,null,null,null,"受付店",null,null,null,null,null,"受付番号",null,null,null,null,null,null,null,null,null,null,null,null,null,null,null,null,null,null,null,null,null,null,null,null,null,null,null,null,"受付枚数"]
[null,null,null,null,null,null,null,null,null,null,null,null,null,null,null,null,null,null,null,null,null,null,null,null,null,null,null,null,null,null,{"$f":"INDEX('(0)作業受付票'!$AE$2,)","v":"　"}]
[null,null,null,null,null,null,null,null,null,null,null,null,null,null,null,null,null,null,null,null,null,null,null,null,null,null,null,null,null,null,null,null,null,null,null,null,"受付日時",null,null,null,null,null,{"$f":"NOW()","v":"2019-08-02T19:23:41.580"}]
[]
["会社名",null,null,null,null,null,{"$f":"INDEX('(0)作業受付票'!$G$5,)","v":""},null,null,null,null,null,null,null,null,null,null,null,null,null,null,null,null,null,"番組名",null,null,null,null,null,{"$f":"INDEX('(0)作業受付票'!$G$9,)","v":""},null,null,null,null,null,null,null,null,null,null,null,null,null,null,null,null,null,"担当者名",null,null,null,null,null,{"$f":"INDEX('(0)作業受付票'!$AR$11,)","v":""}]
[]
["プロキシ作成 (デジタイズ・データ変換と同時発注時に使用する／後日発注の場合はデータ変換で計上)"]
["元コーデック",null,null,null,null,null,null,null,null,"→",null,"変換先コーデック",null,null,null,null,null,null,null,null,"ダウンコンバート",null,null,null,null,null,null,null,"TC焼付有無・位置",null,null,null,null,null,null,null,"備考／変換時間・保存先HDD",null,null,null,null,null,null,null,null,null,null,null,null,null,null,null,null,null,null,null,null,null,null,null,null,"機械的／人的",null,null,null,null,null,null,null,"作業者"]
[null,null,null,null,null,null,null,null,null,"→",null,null,null,null,null,null,null,null,null,null,null,null,null,null,null,null,null,null,null,null,null,null,null,null,null,null,null,null,null,null,null,null,null,null,null,null,null,null,null,null,null,null,null,null,null,null,null,null,null,null,null,"C"]
[null,null,null,null,null,null,null,null,null,null,null,null,null,null,null,null,null,null,null,null,null,null,null,null,null,null,null,null,null,null,null,null,null,null,null,null,null,null,null,null,null,null,null,null,null,null,null,null,null,null,null,null,null,null,null,null,null,null,null,null,null,"B"]
[null,null,null,null,null,null,null,null,null,"→",null,null,null,null,null,null,null,null,null,null,null,null,null,null,null,null,null,null,null,null,null,null,null,null,null,null,null,null,null,null,null,null,null,null,null,null,null,null,null,null,null,null,null,null,null,null,null,null,null,null,null,"C"]
[null,null,null,null,null,null,null,null,null,null,null,null,null,null,null,null,null,null,null,null,null,null,null,null,null,null,null,null,null,null,null,null,null,null,null,null,null,null,null,null,null,null,null,null,null,null,null,null,null,null,null,null,null,null,null,null,null,null,null,null,null,"B"]
[null,null,null,null,null,null,null,null,null,"→",null,null,null,null,null,null,null,null,null,null,null,null,null,null,null,null,null,null,null,null,null,null,null,null,null,null,null,null,null,null,null,null,null,null,null,null,null,null,null,null,null,null,null,null,null,null,null,null,null,null,null,"C"]
[null,null,null,null,null,null,null,null,null,null,null,null,null,null,null,null,null,null,null,null,null,null,null,null,null,null,null,null,null,null,null,null,null,null,null,null,null,null,null,null,null,null,null,null,null,null,null,null,null,null,null,null,null,null,null,null,null,null,null,null,null,"B"]
[]
["抜き作業"]
["区分",null,null,null,null,null,"抜き箇所及び料金",null,null,null,null,null,null,null,null,null,null,null,null,null,null,null,null,null,null,null,null,null,null,null,null,null,null,null,null,null,"合計抜き箇所",null,null,null,null,null,null,null,null,null,"備考／保存先HDD",null,null,null,null,null,null,null,null,null,null,null,null,null,null,"人的",null,null,null,null,null,null,null,"作業者"]
["9pin制御\n可能",null,null,null,null,null,"1～2",null,null,null,"3～5",null,null,null,"6～15",null,null,null,"16～22",null,null,null,"23～30",null,null,null,"31箇所～",null,null,null,null,null,null,null,null,null,"9pin制御可能",null,null,null,null,null,null,null,null,null,null,null,null,null,null,null,null,null,null,null,null,null,null,null,null,"B"]
[null,null,null,null,null,null,"課金なし",null,null,null,"B10",null,null,null,"B30",null,null,null,"B45",null,null,null,"B60",null,null,null,"2分/箇所で計算",null,null,null,null,null,null,null,null,null,"箇所"]
["9pin制御\n不可能",null,null,null,null,null,"1～2",null,null,null,"3～5",null,null,null,"6～7",null,null,null,"8～10",null,null,null,"11～15",null,null,null,"16箇所～",null,null,null,null,null,null,null,null,null,"9pin制御不可能",null,null,null,null,null,null,null,null,null,null,null,null,null,null,null,null,null,null,null,null,null,null,null,null,"B"]
[null,null,null,null,null,null,"課金なし",null,null,null,"B30",null,null,null,"B45",null,null,null,"B60",null,null,null,"B90",null,null,null,"6分/箇所で計算",null,null,null,null,null,null,null,null,null,"箇所"]
["機械的料金は不要／TCブレイクごとのリネーム指定もこの料金で計上"]
["静止画書き出し"]
["区分",null,null,null,null,null,null,null,null,null,"枚数及び料金",null,null,null,null,null,null,null,null,null,null,null,null,null,null,null,null,null,null,null,null,null,null,null,null,null,"合計枚数",null,null,null,null,null,null,null,null,null,"備考／保存先HDD",null,null,null,null,null,null,null,null,null,null,null,null,null,null,"人的",null,null,null,null,null,null,null,"作業者"]
["人的のみ\n関連作業のデジタイズ本数は問わない",null,null,null,null,null,null,null,null,null,"1～5",null,null,null,"6～15",null,null,null,"16～22",null,null,null,"23～30",null,null,null,"31箇所～",null,null,null,null,null,null,null,null,null,null,null,null,null,null,null,null,null,null,null,null,null,null,null,null,null,null,null,null,null,null,null,null,null,null,"B"]
[null,null,null,null,null,null,null,null,null,null,"B30",null,null,null,"B45",null,null,null,"B60",null,null,null,"B90",null,null,null,"6分/箇所で計算",null,null,null,null,null,null,null,null,null,"箇所"]
["機械的料金は不要／静止画用のデジタイズを実施する場合は、書き出し枚数に関わらず【FCP HD 30分/本】で計上"]
["データ転送"]
["転送時間",null,null,null,null,null,null,null,null,null,null,null,null,null,null,null,null,null,null,null,null,null,null,null,null,"機械的",null,null,null,null,null,null,null,"作業者",null,null,"転送時間",null,null,null,null,null,null,null,null,null,null,null,null,null,null,null,null,null,null,null,null,null,null,null,null,"機械的",null,null,null,null,null,null,null,"作業者"]
["□",null,"アップロード",null,null,null,null,null,null,null,null,null,null,null,null,null,null,null,null,null,null,null,null,null,null,"C",null,null,null,null,null,null,null,null,null,null,"□",null,"アップロード",null,null,null,null,null,null,null,null,null,null,null,null,null,null,null,null,null,null,null,null,null,null,"C"]
["□",null,"ダウンロード",null,null,null,null,null,null,null,null,null,null,null,null,null,null,null,null,null,null,null,null,null,null,null,null,null,null,null,null,null,null,null,null,null,"□",null,"ダウンロード"]
[]
["その他"]
["作業内容 (概要・特記事項・変換時間・保存先HDDなど自由記述)",null,null,null,null,null,null,null,null,null,null,null,null,null,null,null,null,null,null,null,null,null,null,null,null,null,null,null,null,null,null,null,null,null,null,null,null,null,null,null,null,null,null,null,null,null,null,null,null,null,null,null,null,null,null,null,null,null,null,"機械的",null,null,null,null,null,null,null,"作業者"]
[null,null,null,null,null,null,null,null,null,null,null,null,null,null,null,null,null,null,null,null,null,null,null,null,null,null,null,null,null,null,null,null,null,null,null,null,null,null,null,null,null,null,null,null,null,null,null,null,null,null,null,null,null,null,null,null,null,null,null,"A"]
[null,null,null,null,null,null,null,null,null,null,null,null,null,null,null,null,null,null,null,null,null,null,null,null,null,null,null,null,null,null,null,null,null,null,null,null,null,null,null,null,null,null,null,null,null,null,null,null,null,null,null,null,null,null,null,null,null,null,null,"B"]
[null,null,null,null,null,null,null,null,null,null,null,null,null,null,null,null,null,null,null,null,null,null,null,null,null,null,null,null,null,null,null,null,null,null,null,null,null,null,null,null,null,null,null,null,null,null,null,null,null,null,null,null,null,null,null,null,null,null,null,"C"]
[null,null,null,null,null,null,null,null,null,null,null,null,null,null,null,null,null,null,null,null,null,null,null,null,null,null,null,null,null,null,null,null,null,null,null,null,null,null,null,null,null,null,null,null,null,null,null,null,null,null,null,null,null,null,null,null,null,null,null,"人的"]
[null,null,null,null,null,null,null,null,null,null,null,null,null,null,null,null,null,null,null,null,null,null,null,null,null,null,null,null,null,null,null,null,null,null,null,null,null,null,null,null,null,null,null,null,null,null,null,null,null,null,null,null,null,null,null,null,null,null,null,"A"]
[null,null,null,null,null,null,null,null,null,null,null,null,null,null,null,null,null,null,null,null,null,null,null,null,null,null,null,null,null,null,null,null,null,null,null,null,null,null,null,null,null,null,null,null,null,null,null,null,null,null,null,null,null,null,null,null,null,null,null,"B"]
{"$rows_left_out":3}