{"text_format":"1","workbook":"xlsx","n_sheets":2,"sheets":["(0)作業受付票","(7)メディア立ち上げ"],"not_rendered":{"charts":0,"images":11,"macros":1,"external_links":0,"defined_names":0,"comments":0,"pivot_tables":0},"unopened":[],"bounds":{"document_bytes":16777216,"sheet_cells":100000,"rows_first":2000,"rows_last":500,"rows_between":2000,"halvings":0,"cell_chars":16384,"cell_head_chars":4096},"cells_cut":0,"cells_raw":0,"read":"whole","date_system":"1900"}

{"sheet":"(0)作業受付票","index":0,"n_rows":54,"n_cols":71,"rows_kept":54,"cut":false,"hidden":false,"merged":[[31,0,31,5],[31,6,31,11],[30,0,30,3],[30,4,30,7],[30,8,30,11],[53,17,53,23],[53,24,53,25],[53,26,53,27],[53,28,53,40],[34,12,35,21],[34,22,35,29],[45,0,45,5],[45,6,45,11],[34,8,34,11],[34,30,35,35],[35,0,35,5],[40,30,41,35],[41,0,41,5],[41,6,41,11],[42,0,42,3],[34,36,35,45],[39,6,39,11],[36,36,37,45],[19,62,19,71],[14,42,15,46],[14,47,15,71],[12,42,13,46],[17,0,17,71],[19,0,19,9],[19,10,19,31],[19,32,19,41],[19,42,19,51],[19,52,19,61],[13,36,15,41],[16,0,16,71],[18,0,18,71],[12,47,13,71],[0,65,0,71],[1,69,3,71],[4,36,7,41],[8,36,9,41],[10,36,12,41],[8,65,9,66],[10,70,11,71],[9,67,9,71],[8,67,8,71],[7,67,7,71],[6,67,6,71],[5,67,5,71],[4,67,4,71],[4,47,5,66],[6,47,7,66],[8,47,9,64],[10,47,11,69],[1,68,3,68],[1,65,3,67],[4,42,5,46],[6,42,7,46],[8,42,9,46],[10,42,11,46],[0,36,1,41],[0,30,0,35],[1,30,3,35],[0,0,3,5],[4,0,7,5],[8,0,11,5],[12,0,15,5],[4,6,7,35],[8,6,11,35],[12,6,15,35],[0,6,3,29],[20,52,23,61],[20,0,21,9],[22,0,23,9],[24,0,24,71],[25,0,28,9],[25,10,28,19],[25,20,26,25],[27,20,28,25],[25,26,26,71],[20,62,23,71],[20,10,21,16],[20,17,21,23],[20,24,21,31],[22,10,23,16],[22,17,23,31],[27,48,28,52],[27,53,28,57],[27,58,28,71],[27,26,28,31],[27,32,28,37],[27,38,28,42],[27,43,28,47],[20,32,23,41],[20,42,23,51],[36,46,37,47],[30,36,31,45],[30,48,31,57],[30,46,31,47],[34,0,34,3],[29,0,29,1],[29,36,29,37],[32,48,33,57],[32,30,33,35],[33,0,33,5],[33,6,33,11],[32,0,32,3],[32,4,32,7],[35,6,35,11],[36,0,36,3],[36,4,36,7],[36,8,36,11],[36,12,37,21],[36,22,37,29],[34,4,34,7],[32,22,33,29],[30,12,31,21],[30,22,31,29],[30,30,31,35],[40,0,40,3],[40,4,40,7],[30,58,31,65],[30,66,31,71],[32,58,33,65],[32,66,33,71],[34,58,35,65],[34,66,35,71],[40,8,40,11],[40,12,41,21],[40,22,41,29],[36,30,37,35],[37,0,37,5],[37,6,37,11],[38,0,38,3],[38,4,38,7],[38,8,38,11],[38,12,39,21],[38,22,39,29],[38,30,39,35],[39,0,39,5],[32,8,32,11],[32,12,33,21],[34,46,35,47],[46,0,46,1],[46,36,46,37],[46,38,46,53],[42,36,43,45],[42,46,43,47],[42,48,43,57],[44,36,45,45],[44,46,45,47],[44,48,45,57],[43,6,43,11],[44,0,44,3],[44,4,44,7],[44,8,44,11],[44,12,45,21],[44,22,45,29],[44,30,45,35],[42,30,43,35],[43,0,43,5],[42,4,42,7],[42,8,42,11],[42,12,43,21],[42,22,43,29],[48,54,49,55],[47,54,47,69],[34,48,35,57],[36,48,37,57],[38,58,39,65],[38,66,39,71],[40,58,41,65],[40,66,41,71],[46,54,46,55],[46,56,46,71],[42,58,43,65],[42,66,43,71],[44,58,45,65],[44,66,45,71],[36,58,37,65],[36,66,37,71],[52,0,53,9],[53,10,53,11],[47,31,48,35],[49,31,50,35],[52,12,52,16],[51,17,51,23],[52,17,52,23],[51,0,51,1],[51,2,51,9],[51,10,51,11],[52,10,52,11],[48,0,49,3],[50,0,50,3],[51,12,51,16],[50,20,50,27],[47,28,48,30],[49,28,50,30],[48,12,49,19],[50,12,50,19],[47,12,47,19],[47,20,47,27],[48,20,49,27],[51,28,51,40],[53,12,53,16],[52,47,52,48],[51,41,51,42],[52,41,52,42],[52,49,53,71],[52,28,52,40],[51,43,51,46],[52,43,52,46],[51,24,51,25],[52,24,52,25],[51,26,51,27],[52,26,52,27],[53,41,53,42],[53,43,53,46],[53,47,53,48],[51,47,51,48],[51,49,51,71],[0,42,1,64],[2,36,3,41],[2,42,3,64],[29,2,29,35],[29,38,29,71],[46,2,46,35],[47,36,50,51],[47,52,50,53],[47,0,47,3],[47,4,47,11],[48,4,49,11],[50,4,50,11],[50,54,50,69],[32,36,33,45],[32,46,33,47],[50,70,50,71],[48,56,49,71],[47,70,47,71],[38,36,39,45],[38,46,39,47],[38,48,39,57],[40,36,41,45],[40,46,41,47],[40,48,41,57]]}
[0,null,null,null,null,null,"作業受付票(表紙)",null,null,null,null,null,null,null,null,null,null,null,null,null,null,null,null,null,null,null,null,null,null,null,"受付店",null,null,null,null,null,"受付番号",null,null,null,null,null,null,null,null,null,null,null,null,null,null,null,null,null,null,null,null,null,null,null,null,null,null,null,null,"受付枚数"]
[null,null,null,null,null,null,null,null,null,null,null,null,null,null,null,null,null,null,null,null,null,null,null,null,null,null,null,null,null,null,"　"]
[null,null,null,null,null,null,null,null,null,null,null,null,null,null,null,null,null,null,null,null,null,null,null,null,null,null,null,null,null,null,null,null,null,null,null,null,"受付日時",null,null,null,null,null,{"$f":"NOW()","v":"2019-07-01T12:56:37.190"}]
[]
["会社名\n(部署名)",null,null,null,null,null,"",null,null,null,null,null,null,null,null,null,null,null,null,null,null,null,null,null,null,null,null,null,null,null,null,null,null,null,null,null,"\nご請求先",null,null,null,null,null,"会社名",null,null,null,null,"",null,null,null,null,null,null,null,null,null,null,null,null,null,null,null,null,null,null,null,"決済方法"]
[null,null,null,null,null,null,null,null,null,null,null,null,null,null,null,null,null,null,null,null,null,null,null,null,null,null,null,null,null,null,null,null,null,null,null,null,null,null,null,null,null,null,null,null,null,null,null,null,null,null,null,null,null,null,null,null,null,null,null,null,null,null,null,null,null,null,null,"請求以外の場合"]
[null,null,null,null,null,null,null,null,null,null,null,null,null,null,null,null,null,null,null,null,null,null,null,null,null,null,null,null,null,null,null,null,null,null,null,null,null,null,null,null,null,null,"部署名",null,null,null,null,"",null,null,null,null,null,null,null,null,null,null,null,null,null,null,null,null,null,null,null,"店頭クレカ"]
[null,null,null,null,null,null,null,null,null,null,null,null,null,null,null,null,null,null,null,null,null,null,null,null,null,null,null,null,null,null,null,null,null,null,null,null,null,null,null,null,null,null,null,null,null,null,null,null,null,null,null,null,null,null,null,null,null,null,null,null,null,null,null,null,null,null,null,"WEBクレカ"]
["番組名\n作品名",null,null,null,null,null,"",null,null,null,null,null,null,null,null,null,null,null,null,null,null,null,null,null,null,null,null,null,null,null,null,null,null,null,null,null,"ご指定がある場合に記入してください",null,null,null,null,null,"お名前",null,null,null,null,"",null,null,null,null,null,null,null,null,null,null,null,null,null,null,null,null,null,"様",null,"コンビニ振込"]
[null,null,null,null,null,null,null,null,null,null,null,null,null,null,null,null,null,null,null,null,null,null,null,null,null,null,null,null,null,null,null,null,null,null,null,null,null,null,null,null,null,null,null,null,null,null,null,null,null,null,null,null,null,null,null,null,null,null,null,null,null,null,null,null,null,null,null,"銀行振込"]
[null,null,null,null,null,null,null,null,null,null,null,null,null,null,null,null,null,null,null,null,null,null,null,null,null,null,null,null,null,null,null,null,null,null,null,null,"あなたの\nご連絡先",null,null,null,null,null,"お名前",null,null,null,null,"",null,null,null,null,null,null,null,null,null,null,null,null,null,null,null,null,null,null,null,null,null,null,"様"]
[]
["副題名",null,null,null,null,null,"",null,null,null,null,null,null,null,null,null,null,null,null,null,null,null,null,null,null,null,null,null,null,null,null,null,null,null,null,null,null,null,null,null,null,null,"電話番号\nご連絡が\n取れる番号",null,null,null,null,""]
[null,null,null,null,null,null,null,null,null,null,null,null,null,null,null,null,null,null,null,null,null,null,null,null,null,null,null,null,null,null,null,null,null,null,null,null,"E-mailは連絡を希望される場合に記入してください"]
[null,null,null,null,null,null,null,null,null,null,null,null,null,null,null,null,null,null,null,null,null,null,null,null,null,null,null,null,null,null,null,null,null,null,null,null,null,null,null,null,null,null,"E-mail",null,null,null,null,""]
[]
[]
["▼ ▼ ▼ ▼ ▼ ▼　ここから下は弊社使用欄のため、記入しないでください　▼ ▼ ▼ ▼ ▼ ▼"]
[]
["納期",null,null,null,null,null,null,null,null,null,"終了連絡",null,null,null,null,null,null,null,null,null,null,null,null,null,null,null,null,null,null,null,null,null,"受付者",null,null,null,null,null,null,null,null,null,"集計者",null,null,null,null,null,null,null,null,null,"お客様引取サイン",null,null,null,null,null,null,null,null,null,"引渡者"]
["/",null,null,null,null,null,null,null,null,null,"不要",null,null,null,null,null,null,"E-mail",null,null,null,null,null,null,"電話(24h可)"]
[]
[":",null,null,null,null,null,null,null,null,null,"電話\n(時間指定)"]
[]
["作業完了後の引取方法"]
["店頭引取",null,null,null,null,null,null,null,null,null,"作業後配送",null,null,null,null,null,null,null,null,null,"配送先"]
[]
[null,null,null,null,null,null,null,null,null,null,null,null,null,null,null,null,null,null,null,null,"配送区分",null,null,null,null,null,"月",null,null,null,null,null,"日",null,null,null,null,null,"10～12",null,null,null,null,"12～15",null,null,null,null,"15～17",null,null,null,null,"17～20",null,null,null,null,"配送担当者はお客様引渡後\n上部の「引渡者」にサインしてください"]
[]
["□",null,"デジタイズ",null,null,null,null,null,null,null,null,null,null,null,null,null,null,null,null,null,null,null,null,null,null,null,null,null,null,null,null,null,null,null,null,null,"□",null,"ワーク・アーカイブ"]
{"$rows_left_out":25}
{"sheet":"(7)メディア立ち上げ","index":1,"n_rows":53,"n_cols":70,"rows_kept":53,"cut":false,"hidden":false,"merged":[[5,0,5,32],[6,0,8,32],[29,10,30,25],[29,26,32,27],[29,28,32,35],[29,36,32,48],[29,49,29,53],[29,54,29,58],[30,49,30,53],[30,54,30,58],[31,10,32,25],[31,49,31,53],[31,54,31,58],[32,49,32,53],[32,54,32,58],[25,10,26,25],[25,26,28,27],[25,28,28,35],[25,36,28,48],[25,49,25,53],[25,54,25,58],[26,49,26,53],[26,54,26,58],[17,54,17,58],[18,49,18,53],[18,54,18,58],[19,10,20,25],[19,49,19,53],[19,54,19,58],[20,49,20,53],[20,54,20,58],[27,10,28,25],[27,49,27,53],[27,54,27,58],[28,49,28,53],[28,54,28,58],[21,36,24,48],[21,49,21,53],[21,54,21,58],[22,49,22,53],[22,54,22,58],[23,10,24,25],[23,49,23,53],[23,54,23,58],[24,49,24,53],[24,54,24,58],[49,59,49,60],[49,61,49,68],[49,69,49,71],[50,59,50,63],[50,64,50,68],[50,69,51,71],[52,69,52,71],[49,10,50,25],[49,26,52,27],[49,28,52,35],[49,36,52,48],[49,49,49,53],[49,54,49,58],[50,49,50,53],[50,54,50,58],[51,10,52,25],[51,49,51,53],[51,54,51,58],[52,49,52,53],[52,54,52,58],[46,59,46,63],[46,64,46,68],[45,10,46,25],[45,26,48,27],[45,28,48,35],[45,36,48,48],[45,49,45,53],[45,54,45,58],[46,49,46,53],[46,54,46,58],[47,10,48,25],[47,49,47,53],[47,54,47,58],[48,49,48,53],[48,54,48,58],[42,54,42,58],[43,10,44,25],[43,49,43,53],[43,54,43,58],[44,49,44,53],[44,54,44,58],[45,59,45,60],[45,61,45,68],[45,69,45,71],[37,28,40,35],[37,36,40,48],[37,49,37,53],[37,54,37,58],[38,49,38,53],[38,54,38,58],[39,10,40,25],[39,49,39,53],[39,54,39,58],[40,49,40,53],[40,54,40,58],[26,69,27,71],[33,59,33,60],[33,61,33,68],[33,69,33,71],[34,59,34,63],[34,64,34,68],[34,69,35,71],[36,69,36,71],[33,10,34,25],[33,26,36,27],[33,28,36,35],[33,36,36,48],[33,49,33,53],[33,54,33,58],[34,49,34,53],[34,54,34,58],[35,10,36,25],[35,49,35,53],[35,54,35,58],[36,49,36,53],[36,54,36,58],[13,0,16,1],[13,2,16,9],[17,69,17,71],[18,59,18,63],[18,64,18,68],[13,26,16,27],[13,28,16,35],[13,54,13,58],[14,54,14,58],[15,54,15,58],[16,54,16,58],[13,49,13,53],[14,49,14,53],[15,49,15,53],[16,49,16,53],[13,36,16,48],[13,10,14,25],[13,69,13,71],[15,10,16,25],[17,10,18,25],[17,26,20,27],[17,28,20,35],[17,36,20,48],[17,49,17,53],[14,59,14,63],[14,64,14,68],[15,59,16,63],[15,64,16,68],[14,69,15,71],[16,69,16,71],[13,59,13,60],[13,61,13,68],[51,59,52,63],[51,64,52,68],[46,69,47,71],[48,69,48,71],[38,69,39,71],[40,69,40,71],[39,59,40,63],[39,64,40,68],[28,69,28,71],[27,59,28,63],[27,64,28,68],[21,69,21,71],[22,59,22,63],[22,64,22,68],[22,69,23,71],[24,69,24,71],[49,0,52,1],[49,2,52,9],[47,59,48,63],[47,64,48,68],[42,69,43,71],[44,69,44,71],[45,0,48,1],[45,2,48,9],[43,59,44,63],[43,64,44,68],[41,0,44,1],[41,2,44,9],[41,59,41,60],[41,61,41,68],[41,69,41,71],[42,59,42,63],[42,64,42,68],[41,10,42,25],[41,26,44,27],[41,28,44,35],[41,36,44,48],[41,49,41,53],[41,54,41,58],[42,49,42,53],[37,0,40,1],[37,2,40,9],[35,59,36,63],[35,64,36,68],[30,69,31,71],[32,69,32,71],[33,0,36,1],[33,2,36,9],[31,59,32,63],[31,64,32,68],[29,0,32,1],[29,2,32,9],[29,59,29,60],[29,61,29,68],[29,69,29,71],[30,59,30,63],[30,64,30,68],[37,59,37,60],[37,61,37,68],[37,69,37,71],[38,59,38,63],[38,64,38,68],[37,10,38,25],[37,26,40,27],[25,0,28,1],[25,2,28,9],[23,59,24,63],[23,64,24,68],[18,69,19,71],[20,69,20,71],[21,0,24,1],[21,2,24,9],[17,59,17,60],[17,61,17,68],[17,0,20,1],[17,2,20,9],[19,59,20,63],[19,64,20,68],[21,59,21,60],[21,61,21,68],[21,10,22,25],[21,26,24,27],[21,28,24,35],[25,59,25,60],[25,61,25,68],[25,69,25,71],[26,59,26,63],[26,64,26,68],[9,0,12,1],[9,2,12,9],[10,54,11,58],[8,33,8,34],[8,35,8,39],[8,40,8,41],[8,42,8,48],[8,49,8,50],[8,51,8,56],[12,54,12,58],[9,26,12,27],[9,28,12,35],[9,10,10,25],[11,10,12,25],[10,69,12,71],[10,59,11,68],[12,59,12,63],[12,64,12,68],[9,36,12,48],[9,49,9,71],[10,49,11,53],[12,49,12,53],[6,51,6,56],[6,57,8,71],[7,40,7,41],[7,42,7,48],[7,49,7,50],[7,51,7,56],[5,49,5,56],[5,57,5,71],[6,33,7,34],[6,35,7,39],[6,40,6,41],[6,42,6,48],[6,49,6,50],[5,33,5,39],[5,40,5,48],[2,36,3,41],[2,42,3,64],[4,0,4,5],[4,6,4,23],[4,24,4,29],[4,30,4,47],[4,48,4,53],[4,54,4,71],[0,0,3,5],[0,6,3,29],[0,30,0,35],[0,36,1,41],[0,42,1,64],[0,65,0,71],[1,30,3,35],[1,65,3,67],[1,68,3,68],[1,69,3,71]]}
[7,null,null,null,null,null,"メディア立ち上げ",null,null,null,null,null,null,null,null,null,null,null,null,null,null,null,null,null,null,null,null,null,null,null,"受付店",null,null,null,null,null,"受付番号",null,null,null,null,null,null,null,null,null,null,null,null,null,null,null,null,null,null,null,null,null,null,null,null,null,null,null,null,"受付枚数"]
[null,null,null,null,null,null,null,null,null,null,null,null,null,null,null,null,null,null,null,null,null,null,null,null,null,null,null,null,null,null,{"$f":"INDEX('(0)作業受付票'!$AE$2,)","v":"　"}]
[null,null,null,null,null,null,null,null,null,null,null,null,null,null,null,null,null,null,null,null,null,null,null,null,null,null,null,null,null,null,null,null,null,null,null,null,"受付日時",null,null,null,null,null,{"$f":"NOW()","v":"2019-07-01T12:56:37.190"}]
[]
["会社名",null,null,null,null,null,{"$f":"INDEX('(0)作業受付票'!$G$5,)","v":""},null,null,null,null,null,null,null,null,null,null,null,null,null,null,null,null,null,"番組名",null,null,null,null,null,{"$f":"INDEX('(0)作業受付票'!$G$9,)","v":""},null,null,null,null,null,null,null,null,null,null,null,null,null,null,null,null,null,"担当者名",null,null,null,null,null,{"$f":"INDEX('(0)作業受付票'!$AV$11,)","v":""}]
["立ち上げ設定",null,null,null,null,null,null,null,null,null,null,null,null,null,null,null,null,null,null,null,null,null,null,null,null,null,null,null,null,null,null,null,null,"メディア\nバックアップ",null,null,null,null,null,null,"受けテープ・メディア",null,null,null,null,null,null,null,null,"TOCレンタル\nメディアの処理",null,null,null,null,null,null,null,"備考・お預かり品"]
[null,null,null,null,null,null,null,null,null,null,null,null,null,null,null,null,null,null,null,null,null,null,null,null,null,null,null,null,null,null,null,null,null,null,null,"取る\n(推奨)",null,null,null,null,null,null,"出庫(販売)",null,null,null,null,null,null,null,null,"作業後返却"]
[null,null,null,null,null,null,null,null,null,null,null,null,null,null,null,null,null,null,null,null,null,null,null,null,null,null,null,null,null,null,null,null,null,null,null,null,null,null,null,null,null,null,"消去NG(持込)",null,null,null,null,null,null,null,null,"レンタル継続"]
[null,null,null,null,null,null,null,null,null,null,null,null,null,null,null,null,null,null,null,null,null,null,null,null,null,null,null,null,null,null,null,null,null,null,null,"不要",null,null,null,null,null,null,"消去OK(持込)",null,null,null,null,null,null,null,null,"不明"]
[null,null,"【出し】\nメディアの種類",null,null,null,null,null,null,null,"【出し】メディアのラベル名\n(作業者が判別できる範囲で)",null,null,null,null,null,null,null,null,null,null,null,null,null,null,null,"⇒",null,"【受け】\nメディア・\nテープの種類",null,null,null,null,null,null,null,"備考",null,null,null,null,null,null,null,null,null,null,null,null,"▼　▼　▼　弊社使用欄　▼　▼　▼"]
[null,null,null,null,null,null,null,null,null,null,null,null,null,null,null,null,null,null,null,null,null,null,null,null,null,null,null,null,null,null,null,null,null,null,null,null,null,null,null,null,null,null,null,null,null,null,null,null,null,"開始TC",null,null,null,null,"DVD複製",null,null,null,null,"メディアバックアップ",null,null,null,null,null,null,null,null,null,"作業者"]
[null,null,null,null,null,null,null,null,null,null,"受けテープに貼るラベル名\n(上記と一緒の場合は記入不要)"]
[null,null,null,null,null,null,null,null,null,null,null,null,null,null,null,null,null,null,null,null,null,null,null,null,null,null,null,null,null,null,null,null,null,null,null,null,null,null,null,null,null,null,null,null,null,null,null,null,null,"尺(分)",null,null,null,null,"Blu-ray複製",null,null,null,null,"機械的",null,null,null,null,"人的"]
[1,null,null,null,null,null,null,null,null,null,null,null,null,null,null,null,null,null,null,null,null,null,null,null,null,null,"⇒",null,null,null,null,null,null,null,null,null,null,null,null,null,null,null,null,null,null,null,null,null,null,null,null,null,null,null,"DVD複製",null,null,null,null,"C"]
[null,null,null,null,null,null,null,null,null,null,null,null,null,null,null,null,null,null,null,null,null,null,null,null,null,null,null,null,null,null,null,null,null,null,null,null,null,null,null,null,null,null,null,null,null,null,null,null,null,"h",null,null,null,null,"枚",null,null,null,null,"A　　　B",null,null,null,null,"A　　　B"]
[null,null,null,null,null,null,null,null,null,null,null,null,null,null,null,null,null,null,null,null,null,null,null,null,null,null,null,null,null,null,null,null,null,null,null,null,null,null,null,null,null,null,null,null,null,null,null,null,null,null,null,null,null,null,"BD複製"]
[null,null,null,null,null,null,null,null,null,null,null,null,null,null,null,null,null,null,null,null,null,null,null,null,null,null,null,null,null,null,null,null,null,null,null,null,null,null,null,null,null,null,null,null,null,null,null,null,null,"分",null,null,null,null,"枚"]
[2,null,null,null,null,null,null,null,null,null,null,null,null,null,null,null,null,null,null,null,null,null,null,null,null,null,"⇒",null,null,null,null,null,null,null,null,null,null,null,null,null,null,null,null,null,null,null,null,null,null,null,null,null,null,null,"DVD複製",null,null,null,null,"C"]
[null,null,null,null,null,null,null,null,null,null,null,null,null,null,null,null,null,null,null,null,null,null,null,null,null,null,null,null,null,null,null,null,null,null,null,null,null,null,null,null,null,null,null,null,null,null,null,null,null,"h",null,null,null,null,"枚",null,null,null,null,"A　　　B",null,null,null,null,"A　　　B"]
[null,null,null,null,null,null,null,null,null,null,null,null,null,null,null,null,null,null,null,null,null,null,null,null,null,null,null,null,null,null,null,null,null,null,null,null,null,null,null,null,null,null,null,null,null,null,null,null,null,null,null,null,null,null,"BD複製"]
[null,null,null,null,null,null,null,null,null,null,null,null,null,null,null,null,null,null,null,null,null,null,null,null,null,null,null,null,null,null,null,null,null,null,null,null,null,null,null,null,null,null,null,null,null,null,null,null,null,"分",null,null,null,null,"枚"]
[3,null,null,null,null,null,null,null,null,null,null,null,null,null,null,null,null,null,null,null,null,null,null,null,null,null,"⇒",null,null,null,null,null,null,null,null,null,null,null,null,null,null,null,null,null,null,null,null,null,null,null,null,null,null,null,"DVD複製",null,null,null,null,"C"]
[null,null,null,null,null,null,null,null,null,null,null,null,null,null,null,null,null,null,null,null,null,null,null,null,null,null,null,null,null,null,null,null,null,null,null,null,null,null,null,null,null,null,null,null,null,null,null,null,null,"h",null,null,null,null,"枚",null,null,null,null,"A　　　B",null,null,null,null,"A　　　B"]
[null,null,null,null,null,null,null,null,null,null,null,null,null,null,null,null,null,null,null,null,null,null,null,null,null,null,null,null,null,null,null,null,null,null,null,null,null,null,null,null,null,null,null,null,null,null,null,null,null,null,null,null,null,null,"BD複製"]
[null,null,null,null,null,null,null,null,null,null,null,null,null,null,null,null,null,null,null,null,null,null,null,null,null,null,null,null,null,null,null,null,null,null,null,null,null,null,null,null,null,null,null,null,null,null,null,null,null,"分",null,null,null,null,"枚"]
[4,null,null,null,null,null,null,null,null,null,null,null,null,null,null,null,null,null,null,null,null,null,null,null,null,null,"⇒",null,null,null,null,null,null,null,null,null,null,null,null,null,null,null,null,null,null,null,null,null,null,null,null,null,null,null,"DVD複製",null,null,null,null,"C"]
[null,null,null,null,null,null,null,null,null,null,null,null,null,null,null,null,null,null,null,null,null,null,null,null,null,null,null,null,null,null,null,null,null,null,null,null,null,null,null,null,null,null,null,null,null,null,null,null,null,"h",null,null,null,null,"枚",null,null,null,null,"A　　　B",null,null,null,null,"A　　　B"]
[null,null,null,null,null,null,null,null,null,null,null,null,null,null,null,null,null,null,null,null,null,null,null,null,null,null,null,null,null,null,null,null,null,null,null,null,null,null,null,null,null,null,null,null,null,null,null,null,null,null,null,null,null,null,"BD複製"]
[null,null,null,null,null,null,null,null,null,null,null,null,null,null,null,null,null,null,null,null,null,null,null,null,null,null,null,null,null,null,null,null,null,null,null,null,null,null,null,null,null,null,null,null,null,null,null,null,null,"分",null,null,null,null,"枚"]
[5,null,null,null,null,null,null,null,null,null,null,null,null,null,null,null,null,null,null,null,null,null,null,null,null,null,"⇒",null,null,null,null,null,null,null,null,null,null,null,null,null,null,null,null,null,null,null,null,null,null,null,null,null,null,null,"DVD複製",null,null,null,null,"C"]
{"$rows_left_out":23}