{"text_format":"1","workbook":"xlsx","n_sheets":2,"sheets":["(0)作業受付票","(1)Premiere"],"not_rendered":{"charts":0,"images":34,"macros":1,"external_links":0,"defined_names":0,"comments":0,"pivot_tables":0},"unopened":[],"bounds":{"document_bytes":16777216,"sheet_cells":100000,"rows_first":2000,"rows_last":500,"rows_between":2000,"halvings":0,"cell_chars":16384,"cell_head_chars":4096},"cells_cut":0,"cells_raw":0,"read":"whole","date_system":"1900"}

{"sheet":"(0)作業受付票","index":0,"n_rows":53,"n_cols":71,"rows_kept":53,"cut":false,"hidden":false,"merged":[[49,70,49,71],[47,56,48,71],[46,70,46,71],[39,36,40,45],[39,46,40,47],[39,48,40,57],[41,36,42,45],[41,46,42,47],[41,48,42,57],[47,54,48,55],[46,54,46,69],[46,36,49,51],[46,52,49,53],[41,66,42,71],[45,54,45,55],[45,56,45,71],[43,58,44,65],[43,66,44,71],[46,0,46,3],[46,4,46,11],[47,4,48,11],[49,4,49,11],[49,54,49,69],[33,36,34,45],[33,46,34,47],[35,48,36,57],[37,48,38,57],[43,0,43,3],[43,4,43,7],[43,8,43,11],[43,12,44,21],[43,22,44,29],[43,30,44,35],[37,58,38,65],[37,66,38,71],[45,38,45,53],[43,36,44,45],[43,46,44,47],[43,48,44,57],[39,58,40,65],[39,66,40,71],[41,58,42,65],[51,47,51,48],[50,41,50,42],[51,41,51,42],[51,49,52,71],[51,28,51,40],[50,43,50,46],[51,43,51,46],[50,24,50,25],[51,24,51,25],[50,26,50,27],[51,26,51,27],[52,41,52,42],[52,43,52,46],[52,47,52,48],[50,47,50,48],[50,49,50,71],[51,0,52,9],[52,10,52,11],[46,31,47,35],[48,31,49,35],[51,12,51,16],[50,17,50,23],[51,17,51,23],[50,0,50,1],[50,2,50,9],[50,10,50,11],[51,10,51,11],[47,0,48,3],[49,0,49,3],[50,12,50,16],[49,20,49,27],[46,28,47,30],[48,28,49,30],[47,12,48,19],[49,12,49,19],[46,12,46,19],[46,20,46,27],[47,20,48,27],[50,28,50,40],[52,12,52,16],[45,10,45,35],[31,58,32,65],[31,66,32,71],[33,58,34,65],[33,66,34,71],[35,58,36,65],[35,66,36,71],[41,8,41,11],[41,12,42,21],[41,22,42,29],[37,30,38,35],[38,6,38,11],[39,4,39,7],[39,8,39,11],[39,12,40,21],[39,22,40,29],[39,30,40,35],[40,0,40,5],[33,8,33,11],[33,12,34,21],[35,46,36,47],[37,46,38,47],[31,36,32,45],[31,48,32,57],[31,46,32,47],[35,0,35,3],[30,0,30,1],[30,36,30,37],[33,48,34,57],[33,30,34,35],[34,0,34,5],[34,6,34,11],[33,0,33,3],[33,4,33,7],[30,2,30,35],[30,38,30,71],[37,0,37,3],[37,4,37,7],[37,8,37,11],[37,12,38,21],[37,22,38,29],[35,4,35,7],[33,22,34,29],[31,12,32,21],[31,22,32,29],[38,0,38,5],[28,20,29,25],[26,26,27,71],[21,62,24,71],[21,10,22,16],[21,17,22,23],[21,24,22,31],[23,10,24,16],[23,17,24,31],[28,48,29,52],[28,53,29,57],[28,58,29,71],[28,26,29,31],[28,32,29,37],[28,38,29,42],[28,43,29,47],[21,32,24,41],[21,42,24,51],[0,0,3,5],[4,0,7,5],[8,0,11,5],[12,0,15,5],[0,6,3,29],[4,32,7,37],[8,32,9,37],[4,6,7,31],[8,6,11,31],[12,6,15,31],[2,36,3,41],[10,32,12,37],[13,32,15,37],[4,38,5,42],[6,38,7,42],[8,38,9,42],[10,38,11,42],[12,38,13,42],[14,38,15,42],[0,65,0,71],[1,69,3,71],[1,68,3,68],[1,65,3,67],[0,36,1,41],[0,30,0,35],[1,30,3,35],[0,42,1,64],[2,42,3,64],[52,17,52,23],[52,24,52,25],[52,26,52,27],[52,28,52,40],[35,12,36,21],[35,22,36,29],[44,0,44,5],[44,6,44,11],[35,8,35,11],[35,30,36,35],[36,0,36,5],[41,30,42,35],[42,0,42,5],[42,6,42,11],[35,36,36,45],[40,6,40,11],[45,2,45,9],[37,36,38,45],[41,0,41,3],[41,4,41,7],[39,0,39,3],[45,0,45,1],[45,36,45,37],[36,6,36,11],[5,64,6,71],[4,64,4,71],[31,30,32,35],[32,0,32,5],[32,6,32,11],[31,0,31,3],[31,4,31,7],[31,8,31,11],[20,62,20,71],[18,0,18,71],[20,0,20,9],[20,10,20,31],[20,32,20,41],[20,42,20,51],[20,52,20,61],[19,0,19,71],[15,64,15,71],[21,52,24,61],[21,0,22,9],[23,0,24,9],[25,0,25,71],[26,0,29,9],[26,10,29,19],[26,20,27,25],[4,43,5,63],[6,43,7,63],[12,43,13,63],[14,43,15,63],[8,62,9,63],[10,62,11,63],[8,43,9,61],[10,43,11,61],[16,0,17,5],[16,6,17,42],[16,43,17,44],[16,45,17,53],[7,64,8,67],[7,68,8,71],[9,64,10,71],[11,64,12,67],[11,68,12,71],[13,64,13,71],[14,64,14,71],[16,54,16,71],[17,54,17,71]]}
[0,null,null,null,null,null,"作業受付票(表紙)",null,null,null,null,null,null,null,null,null,null,null,null,null,null,null,null,null,null,null,null,null,null,null,"受付店",null,null,null,null,null,"受付番号",null,null,null,null,null,"",null,null,null,null,null,null,null,null,null,null,null,null,null,null,null,null,null,null,null,null,null,null,"受付枚数"]
[null,null,null,null,null,null,null,null,null,null,null,null,null,null,null,null,null,null,null,null,null,null,null,null,null,null,null,null,null,null,"　"]
[null,null,null,null,null,null,null,null,null,null,null,null,null,null,null,null,null,null,null,null,null,null,null,null,null,null,null,null,null,null,null,null,null,null,null,null,"受付日時",null,null,null,null,null,{"$f":"NOW()","v":"2020-06-18T19:46:09.680"}]
[]
["会社名\n(部署名)",null,null,null,null,null,"",null,null,null,null,null,null,null,null,null,null,null,null,null,null,null,null,null,null,null,null,null,null,null,null,null,"\nご請求先",null,null,null,null,null,"会社名",null,null,null,null,"",null,null,null,null,null,null,null,null,null,null,null,null,null,null,null,null,null,null,null,null,"決済方法"]
[null,null,null,null,null,null,null,null,null,null,null,null,null,null,null,null,null,null,null,null,null,null,null,null,null,null,null,null,null,null,null,null,null,null,null,null,null,null,null,null,null,null,null,null,null,null,null,null,null,null,null,null,null,null,null,null,null,null,null,null,null,null,null,null,"請求書以外を\n希望される場合"]
[null,null,null,null,null,null,null,null,null,null,null,null,null,null,null,null,null,null,null,null,null,null,null,null,null,null,null,null,null,null,null,null,null,null,null,null,null,null,"部署名",null,null,null,null,""]
[null,null,null,null,null,null,null,null,null,null,null,null,null,null,null,null,null,null,null,null,null,null,null,null,null,null,null,null,null,null,null,null,null,null,null,null,null,null,null,null,null,null,null,null,null,null,null,null,null,null,null,null,null,null,null,null,null,null,null,null,null,null,null,null,"【店頭】\nクレジット\nカード",null,null,null,"【店頭】\n交通系IC\n(Suica等)"]
["番組名\n作品名",null,null,null,null,null,"",null,null,null,null,null,null,null,null,null,null,null,null,null,null,null,null,null,null,null,null,null,null,null,null,null,"ご指定が\nある場合のみ",null,null,null,null,null,"お名前\nフルネーム必須",null,null,null,null,"",null,null,null,null,null,null,null,null,null,null,null,null,null,null,null,null,null,null,"様"]
[null,null,null,null,null,null,null,null,null,null,null,null,null,null,null,null,null,null,null,null,null,null,null,null,null,null,null,null,null,null,null,null,null,null,null,null,null,null,null,null,null,null,null,null,null,null,null,null,null,null,null,null,null,null,null,null,null,null,null,null,null,null,null,null,"【店頭】\nApplePay\nID / QUICPay"]
[null,null,null,null,null,null,null,null,null,null,null,null,null,null,null,null,null,null,null,null,null,null,null,null,null,null,null,null,null,null,null,null,"あなたの\nご連絡先",null,null,null,null,null,"お名前",null,null,null,null,"",null,null,null,null,null,null,null,null,null,null,null,null,null,null,null,null,null,null,"様"]
[null,null,null,null,null,null,null,null,null,null,null,null,null,null,null,null,null,null,null,null,null,null,null,null,null,null,null,null,null,null,null,null,null,null,null,null,null,null,null,null,null,null,null,null,null,null,null,null,null,null,null,null,null,null,null,null,null,null,null,null,null,null,null,null,"【WEB】\nクレジット\nカード",null,null,null,"【WEB】\nコンビニ\n(現金)"]
["副題名",null,null,null,null,null,"",null,null,null,null,null,null,null,null,null,null,null,null,null,null,null,null,null,null,null,null,null,null,null,null,null,null,null,null,null,null,null,"電話番号\nご連絡が\n取れる番号",null,null,null,null,""]
[null,null,null,null,null,null,null,null,null,null,null,null,null,null,null,null,null,null,null,null,null,null,null,null,null,null,null,null,null,null,null,null,"E-mailは\n連絡を希望される\n場合のみ",null,null,null,null,null,null,null,null,null,null,null,null,null,null,null,null,null,null,null,null,null,null,null,null,null,null,null,null,null,null,null,"税込"]
[null,null,null,null,null,null,null,null,null,null,null,null,null,null,null,null,null,null,null,null,null,null,null,null,null,null,null,null,null,null,null,null,null,null,null,null,null,null,"E-mail",null,null,null,null,""]
[null,null,null,null,null,null,null,null,null,null,null,null,null,null,null,null,null,null,null,null,null,null,null,null,null,null,null,null,null,null,null,null,null,null,null,null,null,null,null,null,null,null,null,null,null,null,null,null,null,null,null,null,null,null,null,null,null,null,null,null,null,null,null,null,"円"]
["免責事項",null,null,null,null,null,"弊社では、作業トラブルによる事後の損害については一切のご負担を致しかねます。",null,null,null,null,null,null,null,null,null,null,null,null,null,null,null,null,null,null,null,null,null,null,null,null,null,null,null,null,null,null,null,null,null,null,null,null,null,null,"同意して申し込む",null,null,null,null,null,null,null,null,"サイン"]
[]
["▼ ▼ ▼ ▼ ▼ ▼ ▼ ▼ ▼　　　ここから下は弊社使用欄のため、記入しないでください　　　▼ ▼ ▼ ▼ ▼ ▼ ▼ ▼ ▼"]
[]
["納期",null,null,null,null,null,null,null,null,null,"終了連絡",null,null,null,null,null,null,null,null,null,null,null,null,null,null,null,null,null,null,null,null,null,"受付者",null,null,null,null,null,null,null,null,null,"集計者",null,null,null,null,null,null,null,null,null,"お客様引取サイン",null,null,null,null,null,null,null,null,null,"引渡者"]
["/",null,null,null,null,null,null,null,null,null,"不要",null,null,null,null,null,null,"E-mail",null,null,null,null,null,null,"電話(24h可)"]
[]
[":",null,null,null,null,null,null,null,null,null,"電話\n(時間指定)"]
[]
["作業完了後の引取方法"]
["店頭引取",null,null,null,null,null,null,null,null,null,"作業後配送",null,null,null,null,null,null,null,null,null,"配送先"]
[]
[null,null,null,null,null,null,null,null,null,null,null,null,null,null,null,null,null,null,null,null,"配送区分",null,null,null,null,null,"月",null,null,null,null,null,"日",null,null,null,null,null,"10～12",null,null,null,null,"12～15",null,null,null,null,"15～17",null,null,null,null,"17～20",null,null,null,null,"配送担当者はお客様引渡後\n上部の「引渡者」にサインしてください"]
[]
["□",null,"デジタイズ",null,null,null,null,null,null,null,null,null,null,null,null,null,null,null,null,null,null,null,null,null,null,null,null,null,null,null,null,null,null,null,null,null,"□",null,"ワーク・アーカイブ"]
["FCP",null,null,null,"Avid",null,null,null,"Edius",null,null,null,"テープの種類",null,null,null,null,null,null,null,null,null,"分×",null,null,null,null,null,null,null,"本",null,null,null,null,null,"出し",null,null,null,null,null,null,null,null,null,"⇒",null,"受け",null,null,null,null,null,null,null,null,null,"分×",null,null,null,null,null,null,null,"本"]
["Premiere",null,null,null,null,null,"Prunus"]
["FCP",null,null,null,"Avid",null,null,null,"Edius",null,null,null,"テープの種類",null,null,null,null,null,null,null,null,null,"分×",null,null,null,null,null,null,null,"本",null,null,null,null,null,"出し",null,null,null,null,null,null,null,null,null,"⇒",null,"受け",null,null,null,null,null,null,null,null,null,"分×",null,null,null,null,null,null,null,"本"]
["Premiere",null,null,null,null,null,"Prunus"]
["FCP",null,null,null,"Avid",null,null,null,"Edius",null,null,null,"テープの種類",null,null,null,null,null,null,null,null,null,"分×",null,null,null,null,null,null,null,"本",null,null,null,null,null,"出し",null,null,null,null,null,null,null,null,null,"⇒",null,"受け",null,null,null,null,null,null,null,null,null,"分×",null,null,null,null,null,null,null,"本"]
["Premiere",null,null,null,null,null,"Prunus"]
["FCP",null,null,null,"Avid",null,null,null,"Edius",null,null,null,"テープの種類",null,null,null,null,null,null,null,null,null,"分×",null,null,null,null,null,null,null,"本",null,null,null,null,null,"出し",null,null,null,null,null,null,null,null,null,"⇒",null,"受け",null,null,null,null,null,null,null,null,null,"分×",null,null,null,null,null,null,null,"本"]
["Premiere",null,null,null,null,null,"Prunus"]
["FCP",null,null,null,"Avid",null,null,null,"Edius",null,null,null,"テープの種類",null,null,null,null,null,null,null,null,null,"分×",null,null,null,null,null,null,null,"本",null,null,null,null,null,"出し",null,null,null,null,null,null,null,null,null,"⇒",null,"受け",null,null,null,null,null,null,null,null,null,"分×",null,null,null,null,null,null,null,"本"]
{"$rows_left_out":14}
{"sheet":"(1)Premiere","index":1,"n_rows":56,"n_cols":70,"rows_kept":56,"cut":false,"hidden":false,"merged":[[4,0,4,5],[4,6,4,23],[4,24,4,29],[4,30,4,47],[4,48,4,53],[4,54,4,71],[46,8,47,27],[46,28,47,35],[48,8,49,35],[12,2,12,7],[12,8,12,9],[12,10,12,15],[12,16,12,17],[12,18,12,23],[11,24,12,25],[13,24,13,25],[13,31,13,32],[11,31,11,32],[11,8,11,9],[19,69,20,71],[18,0,21,1],[18,2,21,7],[14,36,17,48],[14,49,14,71],[50,8,51,27],[50,28,51,35],[52,8,53,35],[54,8,55,27],[56,8,57,35],[54,28,55,35],[18,28,19,35],[18,8,19,27],[14,8,15,27],[14,28,15,35],[16,8,17,35],[22,8,23,27],[22,28,23,35],[24,8,25,35],[42,8,43,27],[42,28,43,35],[44,8,45,35],[20,8,21,35],[2,36,3,41],[2,42,3,64],[0,0,3,5],[0,30,0,35],[0,36,1,41],[0,42,1,64],[0,65,0,71],[1,30,3,35],[1,65,3,67],[1,68,3,68],[1,69,3,71],[0,6,1,29],[2,6,3,29],[39,69,40,71],[40,59,41,63],[40,64,41,68],[27,69,28,71],[28,59,29,63],[27,59,27,63],[27,64,27,68],[30,69,30,71],[34,0,37,1],[34,2,37,7],[34,36,37,48],[35,49,37,53],[35,54,37,58],[30,49,30,56],[30,57,30,58],[30,59,30,60],[30,61,30,68],[31,49,33,53],[31,54,33,58],[31,59,31,63],[31,64,31,68],[34,49,34,56],[35,59,35,63],[35,64,35,68],[13,49,13,50],[10,40,10,48],[11,42,11,48],[38,0,41,1],[38,2,41,7],[34,57,34,58],[34,59,34,60],[34,61,34,68],[18,69,18,71],[22,59,22,60],[22,61,22,68],[22,69,22,71],[26,0,29,1],[26,2,29,7],[26,36,29,48],[13,33,13,39],[14,0,17,1],[14,2,17,7],[26,28,27,35],[28,8,29,35],[29,69,29,71],[26,69,26,71],[23,69,24,71],[24,59,25,63],[25,69,25,71],[6,32,7,33],[8,8,9,9],[22,49,22,56],[18,36,21,48],[18,49,18,56],[10,8,10,15],[10,16,10,23],[22,36,25,48],[23,49,25,53],[23,54,25,58],[8,10,9,15],[8,16,9,17],[17,49,17,53],[17,54,17,58],[12,42,12,48],[13,42,13,48],[13,40,13,41],[6,26,7,31],[11,10,11,15],[11,16,11,17],[11,18,11,23],[12,31,12,32],[12,40,12,41],[15,69,17,71],[17,59,17,63],[17,64,17,68],[21,69,21,71],[15,59,16,68],[19,59,19,63],[19,64,19,68],[20,59,21,63],[20,64,21,68],[35,69,36,71],[30,0,33,1],[30,2,33,7],[30,36,33,48],[36,59,37,63],[36,64,37,68],[37,69,37,71],[31,69,32,71],[34,69,34,71],[33,69,33,71],[32,59,33,63],[32,64,33,68],[28,64,29,68],[26,59,26,60],[26,61,26,68],[27,49,29,53],[27,54,29,58],[26,8,27,27],[38,36,41,48],[38,49,38,56],[38,57,38,58],[38,59,38,60],[38,61,38,68],[39,49,41,53],[39,54,41,58],[39,59,39,63],[39,64,39,68],[41,69,41,71],[38,69,38,71],[43,69,44,71],[46,0,49,1],[46,2,49,7],[46,36,49,48],[47,49,49,53],[47,54,49,58],[42,0,45,1],[42,2,45,7],[42,36,45,48],[42,49,42,56],[42,57,42,58],[42,59,42,60],[42,61,42,68],[43,49,45,53],[43,54,45,58],[43,59,43,63],[43,64,43,68],[46,57,46,58],[46,59,46,60],[46,61,46,68],[46,69,46,71],[45,69,45,71],[44,64,45,68],[42,69,42,71],[54,0,57,1],[54,2,57,7],[54,36,57,48],[54,49,54,56],[50,49,50,56],[50,57,50,58],[50,59,50,60],[50,61,50,68],[56,59,57,63],[56,64,57,68],[55,49,57,53],[55,54,57,58],[55,59,55,63],[55,64,55,68],[57,69,57,71],[54,69,54,71],[54,57,54,58],[54,59,54,60],[54,61,54,68],[55,69,56,71],[52,59,53,63],[52,64,53,68],[5,0,5,31],[6,34,7,37],[8,34,9,37],[5,38,5,71],[6,38,9,71],[5,32,5,37],[11,51,11,56],[10,49,10,56],[12,51,12,56],[11,0,11,1],[11,2,11,7],[10,0,10,7],[10,24,10,30],[11,26,12,30],[6,2,7,7],[8,2,9,7],[6,0,7,1],[6,16,7,17],[6,18,7,23],[6,24,7,25],[8,18,9,23],[8,24,9,25],[8,26,9,31],[8,32,9,33],[12,0,12,1],[26,49,26,56],[26,57,26,58],[11,40,11,41],[22,0,25,1],[22,2,25,7],[22,57,22,58],[6,8,7,9],[6,10,7,15],[13,26,13,30],[10,31,10,39],[11,33,11,39],[12,33,12,39],[13,51,13,56],[11,57,13,71],[10,57,10,71],[11,49,11,50],[12,49,12,50],[24,64,25,68],[18,57,18,58],[18,59,18,60],[18,61,18,68],[23,59,23,63],[23,64,23,68],[53,69,53,71],[47,59,47,63],[47,64,47,68],[47,69,48,71],[50,69,50,71],[51,49,53,53],[51,54,53,58],[51,59,51,63],[51,64,51,68],[51,69,52,71],[48,59,49,63],[48,64,49,68],[49,69,49,71],[50,0,53,1],[50,2,53,7],[50,36,53,48],[46,49,46,56],[44,59,45,63],[8,0,9,1],[15,49,16,58],[19,49,21,53],[19,54,21,58],[13,0,13,1],[13,2,13,7],[13,8,13,9],[13,10,13,15],[13,16,13,17],[13,18,13,23],[30,8,31,27],[30,28,31,35],[32,8,33,35],[34,8,35,27],[34,28,35,35],[36,8,37,35],[38,8,39,27],[38,28,39,35],[40,8,41,35]]}
[1,null,null,null,null,null,"デジタイズ・データ変換",null,null,null,null,null,null,null,null,null,null,null,null,null,null,null,null,null,null,null,null,null,null,null,"受付店",null,null,null,null,null,"受付番号",null,null,null,null,null,{"$f":"INDEX('(0)作業受付票'!$AQ$1,)","v":""},null,null,null,null,null,null,null,null,null,null,null,null,null,null,null,null,null,null,null,null,null,null,"受付枚数"]
[null,null,null,null,null,null,null,null,null,null,null,null,null,null,null,null,null,null,null,null,null,null,null,null,null,null,null,null,null,null,{"$f":"INDEX('(0)作業受付票'!$AE$2,)","v":"　"}]
[null,null,null,null,null,null,"Adobe Premiere",null,null,null,null,null,null,null,null,null,null,null,null,null,null,null,null,null,null,null,null,null,null,null,null,null,null,null,null,null,"受付日時",null,null,null,null,null,{"$f":"NOW()","v":"2020-06-18T19:46:09.680"}]
[]
["会社名",null,null,null,null,null,{"$f":"INDEX('(0)作業受付票'!$G$5,)","v":""},null,null,null,null,null,null,null,null,null,null,null,null,null,null,null,null,null,"番組名",null,null,null,null,null,{"$f":"INDEX('(0)作業受付票'!$G$9,)","v":""},null,null,null,null,null,null,null,null,null,null,null,null,null,null,null,null,null,"担当者名",null,null,null,null,null,{"$f":"INDEX('(0)作業受付票'!$AR$11,)","v":""}]
["取込コーデック",null,null,null,null,null,null,null,null,null,null,null,null,null,null,null,null,null,null,null,null,null,null,null,null,null,null,null,null,null,null,null,"使用OS",null,null,null,null,null,"その他設定・備考"]
[null,null,"ProRes422\n(ノーマル)",null,null,null,null,null,null,null,"ProRes422\n(HQ)",null,null,null,null,null,null,null,"ProRes422\n(LT)",null,null,null,null,null,null,null,"ProRes422\n(Proxy)",null,null,null,null,null,null,null,"Win"]
[]
[null,null,"DV圧縮",null,null,null,null,null,null,null,"HDV圧縮",null,null,null,null,null,null,null,"DVCPRO\nHD圧縮",null,null,null,null,null,null,null,"XDCAM\nHD422",null,null,null,null,null,null,null,"Mac"]
[]
["タイムコードの焼付",null,null,null,null,null,null,null,"取込音声",null,null,null,null,null,null,null,"HD素材\nダウンコンバート形式",null,null,null,null,null,null,null,"メディア\nバックアップ",null,null,null,null,null,null,"受けHDD",null,null,null,null,null,null,null,null,"HDDフォーマット形式",null,null,null,null,null,null,null,null,"TOCレンタル\nメディアの処理",null,null,null,null,null,null,null,"お預かり品"]
[null,null,"あり(中上)",null,null,null,null,null,null,null,"1・2chのみ",null,null,null,null,null,null,null,"レターボックス",null,null,null,null,null,null,null,"取る\n(推奨)",null,null,null,null,null,null,"新規レンタル",null,null,null,null,null,null,null,null,"Mac(HFS+)",null,null,null,null,null,null,null,null,"作業後返却"]
[null,null,"あり(中下)",null,null,null,null,null,null,null,"4chパラ",null,null,null,null,null,null,null,"サイドカット",null,null,null,null,null,null,null,null,null,null,null,null,null,null,"消去NG(持込)",null,null,null,null,null,null,null,null,"Win(NTFS)",null,null,null,null,null,null,null,null,"レンタル継続"]
[null,null,"なし",null,null,null,null,null,null,null,"8chパラ",null,null,null,null,null,null,null,"スクイーズ",null,null,null,null,null,null,null,"不要",null,null,null,null,null,null,"消去OK(持込)",null,null,null,null,null,null,null,null,"exFAT",null,null,null,null,null,null,null,null,"不明"]
[null,null,"メディア・テープの種類",null,null,null,null,null,"メディア・テープの名前(作業者が判別できる範囲で)",null,null,null,null,null,null,null,null,null,null,null,null,null,null,null,null,null,null,null,"EDL No.(英数6桁)",null,null,null,null,null,null,null,"備考",null,null,null,null,null,null,null,null,null,null,null,null,"▼　▼　▼　弊社使用欄　▼　▼　▼"]
[null,null,null,null,null,null,null,null,null,null,null,null,null,null,null,null,null,null,null,null,null,null,null,null,null,null,null,null,null,null,null,null,null,null,null,null,null,null,null,null,null,null,null,null,null,null,null,null,null,"尺(分)",null,null,null,null,null,null,null,null,null,"メディアバックアップ",null,null,null,null,null,null,null,null,null,"作業者"]
[null,null,null,null,null,null,null,null,"取込クリップ名(ファイル名)"]
[null,null,null,null,null,null,null,null,null,null,null,null,null,null,null,null,null,null,null,null,null,null,null,null,null,null,null,null,null,null,null,null,null,null,null,null,null,null,null,null,null,null,null,null,null,null,null,null,null,"一時保存先",null,null,null,null,"最終保存先",null,null,null,null,"機械的",null,null,null,null,"人的"]
[1,null,null,null,null,null,null,null,null,null,null,null,null,null,null,null,null,null,null,null,null,null,null,null,null,null,null,null,null,null,null,null,null,null,null,null,null,null,null,null,null,null,null,null,null,null,null,null,null,null,null,null,null,null,null,null,null,"分",null,"C"]
[null,null,null,null,null,null,null,null,null,null,null,null,null,null,null,null,null,null,null,null,null,null,null,null,null,null,null,null,null,null,null,null,null,null,null,null,null,null,null,null,null,null,null,null,null,null,null,null,null,null,null,null,null,null,null,null,null,null,null,"A　　B　　C",null,null,null,null,"A　　　B"]
[]
[]
[2,null,null,null,null,null,null,null,null,null,null,null,null,null,null,null,null,null,null,null,null,null,null,null,null,null,null,null,null,null,null,null,null,null,null,null,null,null,null,null,null,null,null,null,null,null,null,null,null,null,null,null,null,null,null,null,null,"分",null,"C"]
[null,null,null,null,null,null,null,null,null,null,null,null,null,null,null,null,null,null,null,null,null,null,null,null,null,null,null,null,null,null,null,null,null,null,null,null,null,null,null,null,null,null,null,null,null,null,null,null,null,null,null,null,null,null,null,null,null,null,null,"A　　B　　C",null,null,null,null,"A　　　B"]
[]
[]
[3,null,null,null,null,null,null,null,null,null,null,null,null,null,null,null,null,null,null,null,null,null,null,null,null,null,null,null,null,null,null,null,null,null,null,null,null,null,null,null,null,null,null,null,null,null,null,null,null,null,null,null,null,null,null,null,null,"分",null,"C"]
[null,null,null,null,null,null,null,null,null,null,null,null,null,null,null,null,null,null,null,null,null,null,null,null,null,null,null,null,null,null,null,null,null,null,null,null,null,null,null,null,null,null,null,null,null,null,null,null,null,null,null,null,null,null,null,null,null,null,null,"A　　B　　C",null,null,null,null,"A　　　B"]
[]
[]
[4,null,null,null,null,null,null,null,null,null,null,null,null,null,null,null,null,null,null,null,null,null,null,null,null,null,null,null,null,null,null,null,null,null,null,null,null,null,null,null,null,null,null,null,null,null,null,null,null,null,null,null,null,null,null,null,null,"分",null,"C"]
[null,null,null,null,null,null,null,null,null,null,null,null,null,null,null,null,null,null,null,null,null,null,null,null,null,null,null,null,null,null,null,null,null,null,null,null,null,null,null,null,null,null,null,null,null,null,null,null,null,null,null,null,null,null,null,null,null,null,null,"A　　B　　C",null,null,null,null,"A　　　B"]
[]
[]
[5,null,null,null,null,null,null,null,null,null,null,null,null,null,null,null,null,null,null,null,null,null,null,null,null,null,null,null,null,null,null,null,null,null,null,null,null,null,null,null,null,null,null,null,null,null,null,null,null,null,null,null,null,null,null,null,null,"分",null,"C"]
[null,null,null,null,null,null,null,null,null,null,null,null,null,null,null,null,null,null,null,null,null,null,null,null,null,null,null,null,null,null,null,null,null,null,null,null,null,null,null,null,null,null,null,null,null,null,null,null,null,null,null,null,null,null,null,null,null,null,null,"A　　B　　C",null,null,null,null,"A　　　B"]
[]
[]
[6,null,null,null,null,null,null,null,null,null,null,null,null,null,null,null,null,null,null,null,null,null,null,null,null,null,null,null,null,null,null,null,null,null,null,null,null,null,null,null,null,null,null,null,null,null,null,null,null,null,null,null,null,null,null,null,null,"分",null,"C"]
[null,null,null,null,null,null,null,null,null,null,null,null,null,null,null,null,null,null,null,null,null,null,null,null,null,null,null,null,null,null,null,null,null,null,null,null,null,null,null,null,null,null,null,null,null,null,null,null,null,null,null,null,null,null,null,null,null,null,null,"A　　B　　C",null,null,null,null,"A　　　B"]
{"$rows_left_out":16}